Executing(%prep): /bin/sh -e /var/opt/freeware/tmp/rpm-tmp.28274
+ umask 022
+ cd /home/sushma/rpmbuild/BUILD
+ cd /home/sushma/rpmbuild/BUILD
+ rm -rf wget-1.19.1
+ /bin/gzip -dc /home/sushma/rpmbuild/SOURCES/wget-1.19.1.tar.gz
+ tar -xf -
+ STATUS=0
+ [ 0 -ne 0 ]
+ cd wget-1.19.1
+ /bin/id -u
+ [ 208 = 0 ]
+ /bin/id -u
+ [ 208 = 0 ]
+ /bin/chmod -Rf a+rX,g-w,o-w .
+ echo Patch #0 (wget-1.19.1-aix.patch):
Patch #0 (wget-1.19.1-aix.patch):
+ patch -p1 -b --suffix .aix -s
+ 0< /home/sushma/rpmbuild/SOURCES/wget-1.19.1-aix.patch
+ echo Patch #1 (test2.patch):
Patch #1 (test2.patch):
+ patch -p0 -s
+ 0< /home/sushma/rpmbuild/SOURCES/test2.patch
+ rm -rf /tmp/wget-1.19.1-32bit
+ mkdir /tmp/wget-1.19.1-32bit
+ mv ABOUT-NLS AUTHORS COPYING ChangeLog GNUmakefile INSTALL MAILING-LIST Makefile.am Makefile.in NEWS README aclocal.m4 build-aux configure configure.ac doc lib m4 maint.mk msdos po src testenv tests util /tmp/wget-1.19.1-32bit
+ mkdir 32bit
+ mv /tmp/wget-1.19.1-32bit/ABOUT-NLS /tmp/wget-1.19.1-32bit/AUTHORS /tmp/wget-1.19.1-32bit/COPYING /tmp/wget-1.19.1-32bit/ChangeLog /tmp/wget-1.19.1-32bit/GNUmakefile /tmp/wget-1.19.1-32bit/INSTALL /tmp/wget-1.19.1-32bit/MAILING-LIST /tmp/wget-1.19.1-32bit/Makefile.am /tmp/wget-1.19.1-32bit/Makefile.in /tmp/wget-1.19.1-32bit/NEWS /tmp/wget-1.19.1-32bit/README /tmp/wget-1.19.1-32bit/aclocal.m4 /tmp/wget-1.19.1-32bit/build-aux /tmp/wget-1.19.1-32bit/configure /tmp/wget-1.19.1-32bit/configure.ac /tmp/wget-1.19.1-32bit/doc /tmp/wget-1.19.1-32bit/lib /tmp/wget-1.19.1-32bit/m4 /tmp/wget-1.19.1-32bit/maint.mk /tmp/wget-1.19.1-32bit/msdos /tmp/wget-1.19.1-32bit/po /tmp/wget-1.19.1-32bit/src /tmp/wget-1.19.1-32bit/testenv /tmp/wget-1.19.1-32bit/tests /tmp/wget-1.19.1-32bit/util 32bit
+ rm -rf /tmp/wget-1.19.1-32bit
+ mkdir 64bit
+ cp -rp 32bit/ABOUT-NLS 32bit/AUTHORS 32bit/COPYING 32bit/ChangeLog 32bit/GNUmakefile 32bit/INSTALL 32bit/MAILING-LIST 32bit/Makefile.am 32bit/Makefile.in 32bit/NEWS 32bit/README 32bit/aclocal.m4 32bit/build-aux 32bit/configure 32bit/configure.ac 32bit/doc 32bit/lib 32bit/m4 32bit/maint.mk 32bit/msdos 32bit/po 32bit/src 32bit/testenv 32bit/tests 32bit/util 64bit/
+ exit 0
Executing(%build): /bin/sh -e /var/opt/freeware/tmp/rpm-tmp.7318
+ umask 022
+ cd /home/sushma/rpmbuild/BUILD
+ cd wget-1.19.1
+ export RM=rm -f
+ export AR=/usr/bin/ar -X32_64
+ cd 64bit
+ export CC=gcc -maix64 -D_LARGE_FILES
+ export OBJECT_MODE=64
+ export LDFLAFS=-Wl,-brtl
+ ./configure --prefix=/opt/freeware --mandir=/opt/freeware/man --infodir=/opt/freeware/info --enable-largefile --enable-opie --enable-digest --enable-nls --disable-ipv6 --disable-rpath --with-libidn=/opt/freeware --with-libiconv-prefix=/opt/freeware --with-ssl=openssl --with-libssl-prefix=/usr --disable-pcre
configure: configuring for GNU Wget 1.19.1
checking for a BSD-compatible install... /opt/freeware/bin/install -c
checking whether build environment is sane... yes
checking for a thread-safe mkdir -p... /opt/freeware/bin/mkdir -p
checking for gawk... no
checking for mawk... no
checking for nawk... nawk
checking whether make sets $(MAKE)... yes
checking whether make supports nested variables... yes
checking build system type... powerpc-ibm-aix6.1.9.0
checking host system type... powerpc-ibm-aix6.1.9.0
checking whether make supports nested variables... (cached) yes
checking for gcc... gcc -maix64 -D_LARGE_FILES
checking whether the C compiler works... yes
checking for C compiler default output file name... a.out
checking for suffix of executables... 
checking whether we are cross compiling... no
checking for suffix of object files... o
checking whether we are using the GNU C compiler... yes
checking whether gcc -maix64 -D_LARGE_FILES accepts -g... yes
checking for gcc -maix64 -D_LARGE_FILES option to accept ISO C89... none needed
checking whether gcc -maix64 -D_LARGE_FILES understands -c and -o together... yes
checking for style of include used by make... GNU
checking dependency style of gcc -maix64 -D_LARGE_FILES... gcc3
checking how to run the C preprocessor... gcc -maix64 -D_LARGE_FILES -E
checking for grep that handles long lines and -e... /opt/freeware/bin/grep
checking for egrep... /opt/freeware/bin/grep -E
checking for ANSI C header files... yes
checking for sys/types.h... yes
checking for sys/stat.h... yes
checking for stdlib.h... yes
checking for string.h... yes
checking for memory.h... yes
checking for strings.h... yes
checking for inttypes.h... yes
checking for stdint.h... yes
checking for unistd.h... yes
checking minix/config.h usability... no
checking minix/config.h presence... no
checking for minix/config.h... no
checking whether it is safe to define __EXTENSIONS__... yes
checking whether _XOPEN_SOURCE should be defined... no
checking for Minix Amsterdam compiler... no
checking the archiver (/usr/bin/ar -X32_64) interface... ar
checking for ar... /usr/bin/ar -X32_64
checking for ranlib... ranlib
checking for _LARGEFILE_SOURCE value needed for large files... no
checking for special C compiler options needed for large files... no
checking for _FILE_OFFSET_BITS value needed for large files... no
checking for a Python interpreter with version >= 3.0... none
checking for a sed that does not truncate output... /opt/freeware/bin/sed
checking whether NLS is requested... yes
checking for msgfmt... /opt/freeware/bin/msgfmt
checking for gmsgfmt... /opt/freeware/bin/msgfmt
checking for xgettext... /opt/freeware/bin/xgettext
checking for msgmerge... /opt/freeware/bin/msgmerge
checking for ld used by gcc -maix64 -D_LARGE_FILES... /usr/bin/ld
checking if the linker (/usr/bin/ld) is GNU ld... no
checking for shared library run path origin... done
checking for CFPreferencesCopyAppValue... no
checking for CFLocaleCopyCurrent... no
checking for GNU gettext in libc... no
checking for iconv... yes
checking for working iconv... no
checking for GNU gettext in libintl... yes
checking whether to use NLS... yes
checking where the gettext function comes from... external libintl
checking how to link with libintl... /opt/freeware/lib/libintl.a -liconv -lc
checking for ranlib... (cached) ranlib
checking for flex... no
checking for lex... lex
checking lex output file root... lex.yy
checking lex library... -ll
checking whether yytext is a pointer... no
checking for an ANSI C-conforming const... yes
checking for inline... inline
checking for working volatile... yes
checking for ANSI C header files... (cached) yes
checking for special C compiler options needed for large files... (cached) no
checking for _FILE_OFFSET_BITS value needed for large files... (cached) no
checking size of off_t... 8
checking for stdbool.h that conforms to C99... yes
checking for _Bool... yes
checking for unistd.h... (cached) yes
checking sys/time.h usability... yes
checking sys/time.h presence... yes
checking for sys/time.h... yes
checking termios.h usability... yes
checking termios.h presence... yes
checking for termios.h... yes
checking sys/ioctl.h usability... yes
checking sys/ioctl.h presence... yes
checking for sys/ioctl.h... yes
checking sys/select.h usability... yes
checking sys/select.h presence... yes
checking for sys/select.h... yes
checking utime.h usability... yes
checking utime.h presence... yes
checking for utime.h... yes
checking sys/utime.h usability... no
checking sys/utime.h presence... no
checking for sys/utime.h... no
checking for stdint.h... (cached) yes
checking for inttypes.h... (cached) yes
checking pwd.h usability... yes
checking pwd.h presence... yes
checking for pwd.h... yes
checking wchar.h usability... yes
checking wchar.h presence... yes
checking for wchar.h... yes
checking whether h_errno is declared... yes
checking size of short... 2
checking size of int... 4
checking size of long... 8
checking size of long long... 8
checking size of void *... 8
checking for size_t... yes
checking for pid_t... yes
checking for uint32_t... yes
checking for uintptr_t... yes
checking for intptr_t... yes
checking for int64_t... yes
checking for sig_atomic_t... yes
checking for sys/socket.h... yes
checking for arpa/inet.h... yes
checking for features.h... no
checking for unistd.h... (cached) yes
checking for wctype.h... yes
checking for sys/stat.h... (cached) yes
checking for netdb.h... yes
checking for netinet/in.h... yes
checking for getopt.h... no
checking for stdio_ext.h... no
checking for termios.h... (cached) yes
checking for sys/time.h... (cached) yes
checking for iconv.h... yes
checking for limits.h... yes
checking for wchar.h... (cached) yes
checking for stdint.h... (cached) yes
checking for inttypes.h... (cached) yes
checking for langinfo.h... yes
checking for xlocale.h... no
checking for sys/mman.h... yes
checking for sys/select.h... (cached) yes
checking for sys/param.h... yes
checking for malloc.h... yes
checking for sys/cdefs.h... yes
checking for spawn.h... yes
checking for strings.h... (cached) yes
checking for sys/file.h... yes
checking for sys/ioctl.h... (cached) yes
checking for sys/uio.h... yes
checking for sys/wait.h... yes
checking for utime.h... (cached) yes
checking for stdlib.h... (cached) yes
checking whether the preprocessor supports include_next... yes
checking whether system header files limit the line length... no
checking whether <sys/socket.h> is self-contained... yes
checking for shutdown... yes
checking whether <sys/socket.h> defines the SHUT_* macros... yes
checking for struct sockaddr_storage... yes
checking for sa_family_t... yes
checking for struct sockaddr_storage.ss_family... yes
checking whether socket is declared without a macro... yes
checking whether connect is declared without a macro... yes
checking whether accept is declared without a macro... no
checking whether bind is declared without a macro... yes
checking whether getpeername is declared without a macro... no
checking whether getsockname is declared without a macro... no
checking whether getsockopt is declared without a macro... yes
checking whether listen is declared without a macro... yes
checking whether recv is declared without a macro... yes
checking whether send is declared without a macro... yes
checking whether recvfrom is declared without a macro... no
checking whether sendto is declared without a macro... yes
checking whether setsockopt is declared without a macro... yes
checking whether shutdown is declared without a macro... yes
checking whether accept4 is declared without a macro... no
checking for working alloca.h... yes
checking for alloca... yes
checking for C/C++ restrict keyword... __restrict
checking whether <wchar.h> uses 'inline' correctly... yes
checking for btowc... yes
checking for _set_invalid_parameter_handler... no
checking for fcntl... yes
checking for symlink... yes
checking for flock... no
checking for isblank... yes
checking for iswctype... yes
checking for mbsrtowcs... yes
checking for mempcpy... no
checking for wmemchr... yes
checking for wmemcpy... yes
checking for wmempcpy... no
checking for futimens... no
checking for getdelim... yes
checking for getdtablesize... yes
checking for __fsetlocking... no
checking for tcgetattr... yes
checking for tcsetattr... yes
checking for getprogname... no
checking for getexecname... no
checking for gettimeofday... yes
checking for nanotime... no
checking for iswcntrl... yes
checking for iswblank... yes
checking for link... yes
checking for lstat... yes
checking for mbsinit... yes
checking for mbrtowc... yes
checking for mprotect... yes
checking for mkostemp... no
checking for mkstemp... yes
checking for tzset... yes
checking for nl_langinfo... yes
checking for pipe... yes
checking for pipe2... no
checking for secure_getenv... no
checking for getuid... yes
checking for geteuid... yes
checking for getgid... yes
checking for getegid... yes
checking for sigaction... yes
checking for sigaltstack... yes
checking for siginterrupt... yes
checking for snprintf... yes
checking for strdup... yes
checking for __xpg_strerror_r... no
checking for catgets... yes
checking for strndup... yes
checking for strptime... yes
checking for localtime_r... yes
checking for timegm... no
checking for futimes... no
checking for futimesat... no
checking for utimensat... no
checking for lutimes... no
checking for vasnprintf... no
checking for wcrtomb... yes
checking for wcwidth... yes
checking for nl_langinfo and CODESET... yes
checking for a traditional french locale... fr_FR
checking whether byte ordering is bigendian... yes
checking whether // is distinct from /... no
checking if environ is properly declared... yes
checking for complete errno.h... yes
checking for sig_atomic_t... (cached) yes
checking for working fcntl.h... no (bad O_NOATIME, O_NOFOLLOW)
checking for mode_t... yes
checking for mbstate_t... yes
checking whether stdin defaults to large file offsets... yes
checking whether fseeko is declared... yes
checking for fseeko... yes
checking whether stat file-mode macros are broken... no
checking for nlink_t... yes
checking whether fchmodat is declared without a macro... no
checking whether fstat is declared without a macro... no
checking whether fstatat is declared without a macro... no
checking whether futimens is declared without a macro... no
checking whether lchmod is declared without a macro... no
checking whether lstat is declared without a macro... no
checking whether mkdirat is declared without a macro... no
checking whether mkfifo is declared without a macro... yes
checking whether mkfifoat is declared without a macro... no
checking whether mknod is declared without a macro... yes
checking whether mknodat is declared without a macro... no
checking whether stat is declared without a macro... no
checking whether utimensat is declared without a macro... no
checking whether ftello is declared... yes
checking for ftello... yes
checking whether ftello works... yes
checking whether getaddrinfo is declared without a macro... yes
checking whether freeaddrinfo is declared without a macro... yes
checking whether gai_strerror is declared without a macro... yes
checking whether getnameinfo is declared without a macro... yes
checking for library containing gethostbyname... none required
checking for gethostbyname... yes
checking for library containing getservbyname... none required
checking for getservbyname... yes
checking for library containing inet_ntop... none required
checking whether inet_ntop is declared... yes
checking for IPv4 sockets... yes
checking for IPv6 sockets... yes
checking whether getdelim is declared... no
checking whether getdtablesize is declared... yes
checking whether getline is declared... no
checking for getopt.h... (cached) no
checking whether getenv is declared... yes
checking whether getpass is declared... yes
checking whether fflush_unlocked is declared... no
checking whether flockfile is declared... yes
checking whether fputs_unlocked is declared... no
checking whether funlockfile is declared... yes
checking whether putc_unlocked is declared... yes
checking for struct timeval... yes
checking for wide-enough struct timeval.tv_sec member... yes
checking whether gettimeofday is declared without a macro... yes
checking for iconv... (cached) yes
checking for working iconv... (cached) no
checking for iconv declaration... 
         extern size_t iconv (iconv_t cd, char * *inbuf, size_t *inbytesleft, char * *outbuf, size_t *outbytesleft);
checking whether limits.h has ULLONG_WIDTH etc.... no
checking for wint_t... yes
checking whether wint_t is too small... no
checking for unsigned long long int... yes
checking for long long int... yes
checking whether stdint.h conforms to C99... yes
checking whether stdint.h predates C++11... no
checking whether stdint.h has UINTMAX_WIDTH etc.... no
checking whether imaxabs is declared without a macro... yes
checking whether imaxdiv is declared without a macro... yes
checking whether strtoimax is declared without a macro... yes
checking whether strtoumax is declared without a macro... yes
checking for inttypes.h... (cached) yes
checking whether the inttypes.h PRIxNN macros are broken... no
checking whether iswcntrl works... yes
checking for towlower... yes
checking for wctype_t... yes
checking for wctrans_t... yes
checking whether wctype is declared without a macro... yes
checking whether iswctype is declared without a macro... yes
checking whether wctrans is declared without a macro... yes
checking whether towctrans is declared without a macro... yes
checking whether included libunistring is requested... no
checking for libunistring... no, consider installing GNU libunistring
checking whether getc_unlocked is declared... yes
checking whether we are using the GNU C Library >= 2.1 or uClibc... no
checking for wchar_t... yes
checking for max_align_t... yes
checking whether NULL can be used in arbitrary expressions... yes
checking whether imported symbols can be declared weak... no
checking pthread.h usability... yes
checking pthread.h presence... yes
checking for pthread.h... yes
checking for multithread API to use... posix
checking whether lstat correctly handles trailing slash... no
checking whether malloc, realloc, calloc are POSIX compliant... yes
checking for a traditional japanese locale... ja_JP
checking for a transitional chinese locale... none
checking for a french Unicode locale... none
checking for mmap... yes
checking for MAP_ANONYMOUS... yes
checking whether memchr works... yes
checking whether memrchr is declared... no
checking whether <limits.h> defines MIN and MAX... no
checking whether <sys/param.h> defines MIN and MAX... yes
checking whether time_t is signed... yes
checking whether alarm is declared... yes
checking whether <sys/select.h> is self-contained... no
checking whether pselect is declared without a macro... yes
checking whether select is declared without a macro... yes
checking for library containing setsockopt... none needed
checking whether select supports a 0 argument... yes
checking whether select detects invalid fds... yes
checking for promoted mode_t type... mode_t
checking for library containing posix_spawn... none required
checking for posix_spawn... yes
checking whether posix_spawn works... yes
checking whether posix_spawnattr_setschedpolicy is supported... yes
checking whether posix_spawnattr_setschedparam is supported... yes
checking for sigset_t... yes
checking for SIGPIPE... yes
checking for stdlib.h... (cached) yes
checking for GNU libc compatible malloc... no
checking for uid_t in sys/types.h... yes
checking whether C symbols are prefixed with underscore at the linker level... no
checking whether snprintf returns a byte count as in C99... yes
checking whether snprintf is declared... yes
checking whether strdup is declared... yes
checking whether strerror(0) succeeds... yes
checking for strerror_r... yes
checking for strerror_r with POSIX signature... yes
checking whether strerror_r works... no
checking whether ffsl is declared without a macro... no
checking whether ffsll is declared without a macro... no
checking whether memmem is declared without a macro... yes
checking whether mempcpy is declared without a macro... no
checking whether memrchr is declared without a macro... no
checking whether rawmemchr is declared without a macro... no
checking whether stpcpy is declared without a macro... yes
checking whether stpncpy is declared without a macro... yes
checking whether strchrnul is declared without a macro... no
checking whether strdup is declared without a macro... yes
checking whether strncat is declared without a macro... yes
checking whether strndup is declared without a macro... yes
checking whether strnlen is declared without a macro... yes
checking whether strpbrk is declared without a macro... yes
checking whether strsep is declared without a macro... yes
checking whether strcasestr is declared without a macro... no
checking whether strtok_r is declared without a macro... yes
checking whether strerror_r is declared without a macro... yes
checking whether strsignal is declared without a macro... yes
checking whether strverscmp is declared without a macro... no
checking whether ffs is declared without a macro... yes
checking whether strcasecmp is declared without a macro... yes
checking whether strncasecmp is declared without a macro... yes
checking whether strndup is declared... (cached) yes
checking whether strnlen is declared... (cached) yes
checking for struct tm.tm_gmtoff... no
checking whether strtok_r is declared... (cached) yes
checking for struct timespec in <time.h>... yes
checking whether clearerr_unlocked is declared... yes
checking whether feof_unlocked is declared... yes
checking whether ferror_unlocked is declared... yes
checking whether fgets_unlocked is declared... no
checking whether fputc_unlocked is declared... no
checking whether fread_unlocked is declared... no
checking whether fwrite_unlocked is declared... no
checking whether getchar_unlocked is declared... yes
checking whether putchar_unlocked is declared... yes
checking whether the utimes function works... yes
checking for struct utimbuf... yes
checking for inttypes.h... yes
checking for stdint.h... yes
checking for intmax_t... yes
checking where to find the exponent in a 'double'... word 0 bit 20
checking for snprintf... (cached) yes
checking for strnlen... yes
checking for wcslen... yes
checking for wcsnlen... yes
checking for mbrtowc... (cached) yes
checking for wcrtomb... (cached) yes
checking whether _snprintf is declared... no
checking whether vsnprintf is declared... yes
checking for alloca as a compiler built-in... yes
checking whether inet_ntop is declared without a macro... yes
checking whether inet_pton is declared without a macro... yes
checking whether btowc(0) is correct... yes
checking whether btowc(EOF) is correct... yes
checking for __builtin_expect... yes
checking for library containing clock_gettime... none required
checking for clock_gettime... yes
checking for clock_settime... yes
checking whether // is distinct from /... (cached) no
checking whether dup2 works... yes
checking for error_at_line... no
checking whether fcntl handles F_DUPFD correctly... yes
checking whether fcntl understands F_DUPFD_CLOEXEC... no
checking whether fcntl is declared without a macro... yes
checking whether openat is declared without a macro... no
checking for flexible array member... yes
checking whether conversion from 'int' to 'long double' works... yes
checking for struct flock.l_type... yes
checking for working POSIX fnmatch... yes
checking whether fopen recognizes a trailing slash... no
checking for fseeko... (cached) yes
checking for ftello... (cached) yes
checking whether ftello works... (cached) yes
checking how to do getaddrinfo, freeaddrinfo and getnameinfo... checking for library containing getaddrinfo... none required
checking for getaddrinfo... yes
checking whether gai_strerror is declared... (cached) yes
checking whether gai_strerrorA is declared... no
checking for gai_strerror with POSIX signature... no
checking for struct sockaddr.sa_len... yes
checking whether getaddrinfo is declared... (cached) yes
checking whether freeaddrinfo is declared... (cached) yes
checking whether getnameinfo is declared... (cached) yes
checking for struct addrinfo... yes
checking for working getdelim function... no
checking for flockfile... yes
checking for funlockfile... yes
checking whether getc_unlocked is declared... (cached) yes
checking whether getdtablesize works... yes
checking for getline... yes
checking for working getline function... no
checking whether __fsetlocking is declared... no
checking whether program_invocation_name is declared... no
checking whether program_invocation_short_name is declared... no
checking whether __argv is declared... no
checking whether __progname is defined in default libraries... 
checking whether gettimeofday clobbers localtime buffer... no
checking for gettimeofday with POSIX signature... yes
checking for library containing gethostbyname... (cached) none required
checking for gethostbyname... (cached) yes
checking for library containing inet_ntop... (cached) none required
checking whether inet_ntop is declared... (cached) yes
checking whether the compiler generally respects inline... no
checking whether INT32_MAX < INTMAX_MAX... yes
checking whether INT64_MAX == LONG_MAX... yes
checking whether UINT32_MAX < UINTMAX_MAX... yes
checking whether UINT64_MAX == ULONG_MAX... yes
checking for ioctl... yes
checking for ioctl with POSIX signature... yes
checking whether iswblank is declared... yes
checking whether langinfo.h defines CODESET... yes
checking whether langinfo.h defines T_FMT_AMPM... yes
checking whether langinfo.h defines ERA... yes
checking whether langinfo.h defines YESEXPR... yes
checking whether nl_langinfo is declared without a macro... yes
checking whether to use the included libunistring... yes
checking whether link obeys POSIX... no
checking whether locale.h conforms to POSIX:2001... yes
checking whether struct lconv is properly defined... yes
checking whether setlocale is declared without a macro... yes
checking whether duplocale is declared without a macro... no
checking for pthread_rwlock_t... yes
checking whether pthread_rwlock_rdlock prefers a writer to a reader... no
checking whether lseek detects pipes... yes
checking whether mbrtowc handles incomplete characters... no
checking whether mbrtowc works as well as mbtowc... guessing yes
checking whether mbrtowc handles incomplete characters... (cached) no
checking whether mbrtowc works as well as mbtowc... (cached) guessing yes
checking whether mbrtowc handles incomplete characters... (cached) no
checking whether mbrtowc works as well as mbtowc... (cached) guessing yes
checking for memrchr... no
checking whether mkdir handles trailing slash... yes
checking whether mkdir handles trailing dot... yes
checking for working mkstemp... yes
checking for working mktime... no
checking for library containing nanosleep... none required
checking for working nanosleep... no (mishandles large arguments)
checking whether getaddrinfo is declared without a macro... (cached) yes
checking whether freeaddrinfo is declared without a macro... (cached) yes
checking whether gai_strerror is declared without a macro... (cached) yes
checking whether getnameinfo is declared without a macro... (cached) yes
checking whether <netinet/in.h> is self-contained... yes
checking whether YESEXPR works... yes
checking whether open recognizes a trailing slash... no
checking whether posix_spawn_file_actions_addclose works... yes
checking whether posix_spawn_file_actions_adddup2 works... yes
checking whether posix_spawn_file_actions_addopen works... yes
checking for raise... yes
checking for sigprocmask... yes
checking for rawmemchr... no
checking for working re_compile_pattern... no
checking libintl.h usability... yes
checking libintl.h presence... yes
checking for libintl.h... yes
checking whether isblank is declared... yes
checking for __secure_getenv... no
checking for issetugid... no
checking whether select supports a 0 argument... (cached) yes
checking whether select detects invalid fds... (cached) yes
checking for library containing getservbyname... (cached) none required
checking for getservbyname... (cached) yes
checking for struct sigaction.sa_sigaction... yes
checking for volatile sig_atomic_t... yes
checking for sighandler_t... no
checking whether pthread_sigmask is declared without a macro... yes
checking whether sigaction is declared without a macro... yes
checking whether sigaddset is declared without a macro... yes
checking whether sigdelset is declared without a macro... yes
checking whether sigemptyset is declared without a macro... yes
checking whether sigfillset is declared without a macro... yes
checking whether sigismember is declared without a macro... yes
checking whether sigpending is declared without a macro... yes
checking whether sigprocmask is declared without a macro... yes
checking for sigprocmask... (cached) yes
checking for stdint.h... (cached) yes
checking for SIZE_MAX... yes
checking for snprintf... (cached) yes
checking whether snprintf respects a size of 1... yes
checking whether printf supports POSIX/XSI format strings with positions... yes
checking for socklen_t... yes
checking for posix_spawnattr_t... yes
checking for posix_spawn_file_actions_t... yes
checking whether posix_spawn is declared without a macro... yes
checking whether posix_spawnp is declared without a macro... yes
checking whether posix_spawnattr_init is declared without a macro... yes
checking whether posix_spawnattr_destroy is declared without a macro... yes
checking whether posix_spawnattr_getsigdefault is declared without a macro... yes
checking whether posix_spawnattr_setsigdefault is declared without a macro... yes
checking whether posix_spawnattr_getsigmask is declared without a macro... yes
checking whether posix_spawnattr_setsigmask is declared without a macro... yes
checking whether posix_spawnattr_getflags is declared without a macro... yes
checking whether posix_spawnattr_setflags is declared without a macro... yes
checking whether posix_spawnattr_getpgroup is declared without a macro... yes
checking whether posix_spawnattr_setpgroup is declared without a macro... yes
checking whether posix_spawnattr_getschedpolicy is declared without a macro... yes
checking whether posix_spawnattr_setschedpolicy is declared without a macro... yes
checking whether posix_spawnattr_getschedparam is declared without a macro... yes
checking whether posix_spawnattr_setschedparam is declared without a macro... yes
checking whether posix_spawn_file_actions_init is declared without a macro... yes
checking whether posix_spawn_file_actions_destroy is declared without a macro... yes
checking whether posix_spawn_file_actions_addopen is declared without a macro... yes
checking whether posix_spawn_file_actions_addclose is declared without a macro... yes
checking whether posix_spawn_file_actions_adddup2 is declared without a macro... yes
checking for ssize_t... yes
checking whether stat handles trailing slashes on directories... yes
checking whether stat handles trailing slashes on files... no
checking for struct stat.st_atim.tv_nsec... no
checking for struct stat.st_atimespec.tv_nsec... no
checking for struct stat.st_atimensec... no
checking for struct stat.st_atim.st__tim.tv_nsec... no
checking for struct stat.st_birthtimespec.tv_nsec... no
checking for struct stat.st_birthtimensec... no
checking for struct stat.st_birthtim.tv_nsec... no
checking for working stdalign.h... yes
checking for max_align_t... (cached) yes
checking whether NULL can be used in arbitrary expressions... (cached) yes
checking which flavor of printf attribute matches inttypes macros... system
checking whether dprintf is declared without a macro... no
checking whether fpurge is declared without a macro... no
checking whether fseeko is declared without a macro... no
checking whether ftello is declared without a macro... no
checking whether getdelim is declared without a macro... no
checking whether getline is declared without a macro... no
checking whether gets is declared without a macro... yes
checking whether pclose is declared without a macro... yes
checking whether popen is declared without a macro... yes
checking whether renameat is declared without a macro... no
checking whether snprintf is declared without a macro... yes
checking whether tmpfile is declared without a macro... yes
checking whether vdprintf is declared without a macro... no
checking whether vsnprintf is declared without a macro... yes
checking whether _Exit is declared without a macro... yes
checking whether atoll is declared without a macro... yes
checking whether canonicalize_file_name is declared without a macro... no
checking whether getloadavg is declared without a macro... no
checking whether getsubopt is declared without a macro... yes
checking whether grantpt is declared without a macro... yes
checking whether initstate is declared without a macro... yes
checking whether initstate_r is declared without a macro... yes
checking whether mkdtemp is declared without a macro... no
checking whether mkostemp is declared without a macro... no
checking whether mkostemps is declared without a macro... no
checking whether mkstemp is declared without a macro... yes
checking whether mkstemps is declared without a macro... no
checking whether posix_openpt is declared without a macro... yes
checking whether ptsname is declared without a macro... yes
checking whether ptsname_r is declared without a macro... no
checking whether qsort_r is declared without a macro... no
checking whether random is declared without a macro... yes
checking whether random_r is declared without a macro... yes
checking whether realpath is declared without a macro... yes
checking whether rpmatch is declared without a macro... yes
checking whether secure_getenv is declared without a macro... no
checking whether setenv is declared without a macro... yes
checking whether setstate is declared without a macro... yes
checking whether setstate_r is declared without a macro... yes
checking whether srandom is declared without a macro... yes
checking whether srandom_r is declared without a macro... yes
checking whether strtod is declared without a macro... yes
checking whether strtoll is declared without a macro... yes
checking whether strtoull is declared without a macro... yes
checking whether unlockpt is declared without a macro... yes
checking whether unsetenv is declared without a macro... yes
checking for strcasecmp... yes
checking for strncasecmp... yes
checking whether strncasecmp is declared... (cached) yes
checking for strchrnul... no
checking for working strerror function... yes
checking whether strerror_r is declared... (cached) yes
checking for working strndup... yes
checking for working strnlen... yes
checking for strpbrk... yes
checking for strtok_r... yes
checking whether strtok_r works... yes
checking for strtoll... yes
checking whether symlink handles trailing slash correctly... no
checking whether flock is declared without a macro... yes
checking whether <sys/ioctl.h> declares ioctl... no
checking whether ioctl is declared without a macro... yes
checking whether <sys/select.h> is self-contained... (cached) no
checking whether pselect is declared without a macro... (cached) yes
checking whether select is declared without a macro... (cached) yes
checking for nlink_t... (cached) yes
checking whether fchmodat is declared without a macro... (cached) no
checking whether fstat is declared without a macro... (cached) no
checking whether fstatat is declared without a macro... (cached) no
checking whether futimens is declared without a macro... (cached) no
checking whether lchmod is declared without a macro... (cached) no
checking whether lstat is declared without a macro... (cached) no
checking whether mkdirat is declared without a macro... (cached) no
checking whether mkfifo is declared without a macro... (cached) yes
checking whether mkfifoat is declared without a macro... (cached) no
checking whether mknod is declared without a macro... (cached) yes
checking whether mknodat is declared without a macro... (cached) no
checking whether stat is declared without a macro... (cached) no
checking whether utimensat is declared without a macro... (cached) no
checking whether waitpid is declared without a macro... yes
checking whether localtime_r is declared... yes
checking whether localtime_r is compatible with its POSIX signature... yes
checking whether chdir is declared without a macro... yes
checking whether chown is declared without a macro... yes
checking whether dup is declared without a macro... yes
checking whether dup2 is declared without a macro... yes
checking whether dup3 is declared without a macro... no
checking whether environ is declared without a macro... yes
checking whether euidaccess is declared without a macro... no
checking whether faccessat is declared without a macro... no
checking whether fchdir is declared without a macro... yes
checking whether fchownat is declared without a macro... no
checking whether fdatasync is declared without a macro... yes
checking whether fsync is declared without a macro... yes
checking whether ftruncate is declared without a macro... no
checking whether getcwd is declared without a macro... yes
checking whether getdomainname is declared without a macro... no
checking whether getdtablesize is declared without a macro... yes
checking whether getgroups is declared without a macro... yes
checking whether gethostname is declared without a macro... yes
checking whether getlogin is declared without a macro... yes
checking whether getlogin_r is declared without a macro... yes
checking whether getpagesize is declared without a macro... yes
checking whether getusershell is declared without a macro... yes
checking whether setusershell is declared without a macro... yes
checking whether endusershell is declared without a macro... yes
checking whether group_member is declared without a macro... no
checking whether isatty is declared without a macro... yes
checking whether lchown is declared without a macro... yes
checking whether link is declared without a macro... yes
checking whether linkat is declared without a macro... no
checking whether lseek is declared without a macro... no
checking whether pipe is declared without a macro... yes
checking whether pipe2 is declared without a macro... no
checking whether pread is declared without a macro... no
checking whether pwrite is declared without a macro... no
checking whether readlink is declared without a macro... yes
checking whether readlinkat is declared without a macro... no
checking whether rmdir is declared without a macro... yes
checking whether sethostname is declared without a macro... no
checking whether sleep is declared without a macro... yes
checking whether symlink is declared without a macro... yes
checking whether symlinkat is declared without a macro... no
checking whether ttyname_r is declared without a macro... yes
checking whether unlink is declared without a macro... yes
checking whether unlinkat is declared without a macro... no
checking whether usleep is declared without a macro... yes
checking whether unlink honors trailing slashes... no
checking whether unlink of a parent directory fails as it should... guessing yes
checking for ptrdiff_t... yes
checking for vasprintf... no
checking for vsnprintf... yes
checking whether snprintf respects a size of 1... (cached) yes
checking whether printf supports POSIX/XSI format strings with positions... (cached) yes
checking for waitid... yes
checking whether btowc is declared without a macro... yes
checking whether wctob is declared without a macro... yes
checking whether mbsinit is declared without a macro... yes
checking whether mbrtowc is declared without a macro... yes
checking whether mbrlen is declared without a macro... yes
checking whether mbsrtowcs is declared without a macro... yes
checking whether mbsnrtowcs is declared without a macro... yes
checking whether wcrtomb is declared without a macro... yes
checking whether wcsrtombs is declared without a macro... yes
checking whether wcsnrtombs is declared without a macro... yes
checking whether wcwidth is declared without a macro... yes
checking whether wmemchr is declared without a macro... yes
checking whether wmemcmp is declared without a macro... yes
checking whether wmemcpy is declared without a macro... yes
checking whether wmemmove is declared without a macro... yes
checking whether wmemset is declared without a macro... yes
checking whether wcslen is declared without a macro... yes
checking whether wcsnlen is declared without a macro... yes
checking whether wcscpy is declared without a macro... yes
checking whether wcpcpy is declared without a macro... yes
checking whether wcsncpy is declared without a macro... yes
checking whether wcpncpy is declared without a macro... yes
checking whether wcscat is declared without a macro... yes
checking whether wcsncat is declared without a macro... yes
checking whether wcscmp is declared without a macro... yes
checking whether wcsncmp is declared without a macro... yes
checking whether wcscasecmp is declared without a macro... yes
checking whether wcsncasecmp is declared without a macro... yes
checking whether wcscoll is declared without a macro... yes
checking whether wcsxfrm is declared without a macro... yes
checking whether wcsdup is declared without a macro... yes
checking whether wcschr is declared without a macro... yes
checking whether wcsrchr is declared without a macro... yes
checking whether wcscspn is declared without a macro... yes
checking whether wcsspn is declared without a macro... yes
checking whether wcspbrk is declared without a macro... yes
checking whether wcsstr is declared without a macro... yes
checking whether wcstok is declared without a macro... yes
checking whether wcswidth is declared without a macro... yes
checking whether mbrtowc handles incomplete characters... (cached) no
checking whether mbrtowc works as well as mbtowc... (cached) guessing yes
checking whether iswcntrl works... (cached) yes
checking for towlower... (cached) yes
checking for wctype_t... (cached) yes
checking for wctrans_t... (cached) yes
checking whether wctype is declared without a macro... (cached) yes
checking whether iswctype is declared without a macro... (cached) yes
checking whether wctrans is declared without a macro... (cached) yes
checking whether towctrans is declared without a macro... (cached) yes
checking whether wcwidth is declared... (cached) yes
checking whether wcwidth works reasonably in UTF-8 locales... yes
checking for stdint.h... (cached) yes
checking for getpagesize... yes
checking for working mmap... yes
checking for _LARGEFILE_SOURCE value needed for large files... (cached) no
checking for strptime... (cached) yes
checking for timegm... (cached) no
checking for vsnprintf... (cached) yes
checking for vasprintf... (cached) no
checking for drand48... yes
checking for pathconf... yes
checking for strtoll... (cached) yes
checking for usleep... yes
checking for ftello... yes
checking for sigblock... yes
checking for sigsetjmp... yes
checking for memrchr... (cached) no
checking for wcwidth... (cached) yes
checking for mbtowc... yes
checking for sleep... yes
checking for symlink... (cached) yes
checking for utime... yes
checking for strlcpy... no
checking for random... yes
checking for pkg-config... /opt/freeware/bin/pkg-config
checking pkg-config is at least version 0.9.0... yes
checking for LIBPSL... no
checking for library containing psl_builtin... no
configure: WARNING: *** libpsl was not found. Fallback to builtin cookie checking.
checking for ZLIB... yes
checking for dlopen in -ldl... yes
checking for libssl... yes
checking how to link with libssl... /usr/lib/libssl.a /usr/lib/libcrypto.a
configure: compiling in support for SSL via OpenSSL
checking for RAND_egd... yes
checking for METALINK... no
configure: disabling IPv6 at user request
checking for makeinfo... ${SHELL} /home/sushma/rpmbuild/BUILD/wget-1.19.1/64bit/build-aux/missing makeinfo
checking for perl5... no
checking for perl... /opt/freeware/bin/perl
checking for pod2man... /opt/freeware/bin/pod2man
checking for library containing idn2_lookup_u8... no
configure: WARNING: *** LIBIDN2 was not found. You will not be able to use IDN2008 support
checking uuid.h usability... yes
checking uuid.h presence... yes
checking for uuid.h... yes
checking for uuid_create... yes
configure: Disabling Extended Attribute support: your system is not known to support extended attributes.
checking that generated files are newer than configure... done
configure: creating ./config.status
config.status: creating Makefile
config.status: creating src/Makefile
config.status: creating doc/Makefile
config.status: creating util/Makefile
config.status: creating po/Makefile.in
config.status: creating tests/Makefile
config.status: creating lib/Makefile
config.status: creating testenv/Makefile
config.status: creating src/config.h
config.status: executing depfiles commands
config.status: executing po-directories commands
config.status: creating po/POTFILES
config.status: creating po/Makefile
configure: Summary of build options:

  Version:           1.19.1
  Host OS:           aix6.1.9.0
  Install prefix:    /opt/freeware
  Compiler:          gcc -maix64 -D_LARGE_FILES
  CFlags:            -I/opt/freeware/include   -DNDEBUG   -D_THREAD_SAFE -I/opt/freeware/include
  LDFlags:           
  Libs:              /usr/lib/libssl.a /usr/lib/libcrypto.a -ldl -L/opt/freeware/lib -lz   
  SSL:               openssl
  Zlib:              yes
  PSL:               no
  Digest:            yes
  NTLM:              yes
  OPIE:              yes
  POSIX xattr:       no
  Debugging:         yes
  Assertions:        no
  Valgrind:          Valgrind testing not enabled
  Metalink:          no
  Resolver:          libc, --bind-dns-address and --dns-servers not available
  GPGME:             no
  IRI:               no

+ make
echo 1.19.1 > .version-t && mv .version-t .version
make  all-recursive
make[1]: Entering directory '/home/sushma/rpmbuild/BUILD/wget-1.19.1/64bit'
Making all in lib
make[2]: Entering directory '/home/sushma/rpmbuild/BUILD/wget-1.19.1/64bit/lib'
  GEN      alloca.h
  GEN      c++defs.h
  GEN      warn-on-use.h
  GEN      arg-nonnull.h
  GEN      arpa/inet.h
  GEN      configmake.h
  GEN      fcntl.h
  GEN      float.h
  GEN      getopt.h
  GEN      inttypes.h
  GEN      langinfo.h
  GEN      limits.h
  GEN      locale.h
  GEN      netdb.h
  GEN      signal.h
  GEN      unused-parameter.h
  GEN      spawn.h
  GEN      stdint.h
  GEN      stdio.h
  GEN      stdlib.h
  GEN      string.h
  GEN      strings.h
  GEN      sys/file.h
  GEN      sys/ioctl.h
  GEN      sys/select.h
  GEN      sys/socket.h
  GEN      sys/stat.h
  GEN      sys/time.h
  GEN      sys/types.h
  GEN      sys/uio.h
  GEN      sys/wait.h
  GEN      time.h
  GEN      unicase.h
  GEN      unictype.h
  GEN      uninorm.h
  GEN      unistd.h
  GEN      unistr.h
  GEN      unitypes.h
  GEN      uniwidth.h
  GEN      wchar.h
  GEN      wctype.h
make  all-recursive
make[3]: Entering directory '/home/sushma/rpmbuild/BUILD/wget-1.19.1/64bit/lib'
make[4]: Entering directory '/home/sushma/rpmbuild/BUILD/wget-1.19.1/64bit/lib'
  CC       base32.o
  CC       binary-io.o
  CC       c-ctype.o
  CC       c-strcasecmp.o
  CC       c-strncasecmp.o
  CC       c-strcasestr.o
  CC       cloexec.o
  CC       md2.o
  CC       md4.o
  CC       md5.o
  CC       sha1.o
  CC       sha256.o
  CC       sha512.o
  CC       dirname.o
  CC       basename.o
  CC       dirname-lgpl.o
  CC       basename-lgpl.o
  CC       stripslash.o
  CC       exitfail.o
  CC       fatal-signal.o
  CC       fd-hook.o
  CC       fd-safer-flag.o
  CC       dup-safer-flag.o
  CC       getprogname.o
  CC       gettime.o
  CC       hard-locale.o
  CC       localcharset.o
  CC       glthread/lock.o
  CC       mbchar.o
  CC       mbiter.o
  CC       pipe2.o
  CC       pipe2-safer.o
  CC       quotearg.o
  CC       sig-handler.o
  CC       sockets.o
  CC       spawn-pipe.o
  CC       stat-time.o
  CC       strnlen1.o
  CC       sys_socket.o
  CC       tempname.o
  CC       glthread/threadlib.o
  CC       timespec.o
  CC       tmpdir.o
  CC       u64.o
  CC       unicase/cased.o
  CC       unicase/empty-prefix-context.o
  CC       unicase/empty-suffix-context.o
  CC       unicase/ignorable.o
  CC       unicase/special-casing.o
  CC       unicase/tolower.o
  CC       unicase/u8-casemap.o
  CC       unicase/u8-tolower.o
  CC       unictype/combiningclass.o
  CC       unictype/pr_soft_dotted.o
  CC       uninorm/decompose-internal.o
  CC       uninorm/u8-normalize.o
  CC       unistd.o
  CC       dup-safer.o
  CC       fd-safer.o
  CC       pipe-safer.o
  CC       unistr/u8-cpy.o
  CC       unistr/u8-mbtouc-unsafe.o
  CC       unistr/u8-mbtouc-unsafe-aux.o
  CC       unistr/u8-strlen.o
  CC       unistr/u8-uctomb.o
  CC       unistr/u8-uctomb-aux.o
  CC       uniwidth/width.o
  CC       utimens.o
  CC       wait-process.o
  CC       wctype-h.o
  CC       xmalloc.o
  CC       xalloc-die.o
  CC       xsize.o
  CC       xstrndup.o
  CC       asnprintf.o
  CC       asprintf.o
  CC       error.o
  CC       fcntl.o
  CC       float.o
  CC       flock.o
  CC       fopen.o
  CC       futimens.o
  CC       gai_strerror.o
  CC       getdelim.o
  CC       getline.o
  CC       getopt.o
  CC       getopt1.o
  CC       getpass.o
  CC       link.o
  CC       lstat.o
  CC       mbrtowc.o
  CC       mbsinit.o
  CC       mbsrtowcs.o
  CC       mbsrtowcs-state.o
  CC       memrchr.o
  CC       mkostemp.o
  CC       mktime.o
  CC       nanosleep.o
  CC       open.o
  CC       printf-args.o
  CC       printf-parse.o
  CC       rawmemchr.o
  CC       regex.o
  CC       secure_getenv.o
  CC       stat.o
  CC       strchrnul.o
  CC       strerror.o
  CC       strerror_r.o
  CC       symlink.o
  CC       timegm.o
  CC       unlink.o
  CC       vasnprintf.o
  CC       vasprintf.o
  CC       wcrtomb.o
  CC       xmemdup0.o
  AR       libgnu.a
  GEN      charset.alias
  GEN      ref-add.sed
  GEN      ref-del.sed
make[4]: Leaving directory '/home/sushma/rpmbuild/BUILD/wget-1.19.1/64bit/lib'
make[3]: Leaving directory '/home/sushma/rpmbuild/BUILD/wget-1.19.1/64bit/lib'
make[2]: Leaving directory '/home/sushma/rpmbuild/BUILD/wget-1.19.1/64bit/lib'
Making all in src
make[2]: Entering directory '/home/sushma/rpmbuild/BUILD/wget-1.19.1/64bit/src'
make  all-am
make[3]: Entering directory '/home/sushma/rpmbuild/BUILD/wget-1.19.1/64bit/src'
  CC       connect.o
  CC       convert.o
  CC       cookies.o
  CC       ftp.o
  CC       css_.o
  CC       css-url.o
  CC       ftp-basic.o
  CC       ftp-ls.o
  CC       hash.o
  CC       host.o
  CC       hsts.o
  CC       html-parse.o
  CC       html-url.o
  CC       http.o
  CC       init.o
  CC       log.o
  CC       main.o
  CC       netrc.o
  CC       progress.o
  CC       ptimer.o
  CC       recur.o
  CC       res.o
  CC       retr.o
  CC       spider.o
  CC       url.o
  CC       warc.o
warc.c: In function 'warc_uuid_str':
warc.c:639:31: warning: passing argument 2 of 'uuid_to_string' from incompatible pointer type [-Wincompatible-pointer-types]
   uuid_to_string (&record_id, &uuid_str, NULL);
                               ^
In file included from warc.c:51:0:
/usr/include/uuid.h:109:13: note: expected 'unsigned char **' but argument is of type 'char **'
 extern void uuid_to_string(uuid_p_t uuid, unsigned char **uuid_string, unsigned32 *status);
             ^~~~~~~~~~~~~~
  CC       utils.o
  CC       exits.o
  CC       build_info.o
echo '/* version.c */' > version.c
echo '/* Autogenerated by Makefile - DO NOT EDIT */' >> version.c
echo '' >> version.c
echo '#include "version.h"' >> version.c
echo 'const char *version_string = "1.19.1";' >> version.c
echo 'const char *compilation_string = "'gcc -maix64 -D_LARGE_FILES -DHAVE_CONFIG_H -DSYSTEM_WGETRC=\"/opt/freeware/etc/wgetrc\" -DLOCALEDIR=\"/opt/freeware/share/locale\" -I.  -I../lib -I../lib -D_THREAD_SAFE -I/opt/freeware/include  -I/opt/freeware/include   -DNDEBUG '";' \
    | sed -e 's/[\\"]/\\&/g' -e 's/\\"/"/' -e 's/\\";$/";/' >> version.c
echo 'const char *link_string = "'gcc -maix64 -D_LARGE_FILES  -I/opt/freeware/include   -DNDEBUG  \
  /usr/lib/libssl.a /usr/lib/libcrypto.a -ldl -L/opt/freeware/lib -lz    ftp-opie.o openssl.o http-ntlm.o ../lib/libgnu.a           /opt/freeware/lib/libintl.a -liconv -lc -pthread   -liconv'";' \
    | sed -e 's/[\\"]/\\&/g' -e 's/\\"/"/' -e 's/\\";$/";/' >> version.c
  CC       version.o
  CC       ftp-opie.o
  CC       openssl.o
  CC       http-ntlm.o
  CCLD     wget
make[3]: Leaving directory '/home/sushma/rpmbuild/BUILD/wget-1.19.1/64bit/src'
make[2]: Leaving directory '/home/sushma/rpmbuild/BUILD/wget-1.19.1/64bit/src'
Making all in doc
make[2]: Entering directory '/home/sushma/rpmbuild/BUILD/wget-1.19.1/64bit/doc'
./texi2pod.pl -D VERSION="1.19.1" ./wget.texi wget.pod
/opt/freeware/bin/pod2man --center="GNU Wget" --release="GNU Wget 1.19.1" --utf8 wget.pod > wget.1 || \
/opt/freeware/bin/pod2man --center="GNU Wget" --release="GNU Wget 1.19.1" wget.pod > wget.1
make[2]: Leaving directory '/home/sushma/rpmbuild/BUILD/wget-1.19.1/64bit/doc'
Making all in po
make[2]: Entering directory '/home/sushma/rpmbuild/BUILD/wget-1.19.1/64bit/po'
make[2]: Nothing to be done for 'all'.
make[2]: Leaving directory '/home/sushma/rpmbuild/BUILD/wget-1.19.1/64bit/po'
Making all in tests
make[2]: Entering directory '/home/sushma/rpmbuild/BUILD/wget-1.19.1/64bit/tests'
make[2]: Nothing to be done for 'all'.
make[2]: Leaving directory '/home/sushma/rpmbuild/BUILD/wget-1.19.1/64bit/tests'
Making all in util
make[2]: Entering directory '/home/sushma/rpmbuild/BUILD/wget-1.19.1/64bit/util'
make[2]: Nothing to be done for 'all'.
make[2]: Leaving directory '/home/sushma/rpmbuild/BUILD/wget-1.19.1/64bit/util'
Making all in testenv
make[2]: Entering directory '/home/sushma/rpmbuild/BUILD/wget-1.19.1/64bit/testenv'
make[2]: Nothing to be done for 'all'.
make[2]: Leaving directory '/home/sushma/rpmbuild/BUILD/wget-1.19.1/64bit/testenv'
make[2]: Entering directory '/home/sushma/rpmbuild/BUILD/wget-1.19.1/64bit'
make[2]: Nothing to be done for 'all-am'.
make[2]: Leaving directory '/home/sushma/rpmbuild/BUILD/wget-1.19.1/64bit'
make[1]: Leaving directory '/home/sushma/rpmbuild/BUILD/wget-1.19.1/64bit'
+ [ 1 == 1 ]
+ gmake -k check
  GEN      public-submodule-commit
gmake  check-recursive
gmake[1]: Entering directory '/home/sushma/rpmbuild/BUILD/wget-1.19.1/64bit'
Making check in lib
gmake[2]: Entering directory '/home/sushma/rpmbuild/BUILD/wget-1.19.1/64bit/lib'
gmake  check-recursive
gmake[3]: Entering directory '/home/sushma/rpmbuild/BUILD/wget-1.19.1/64bit/lib'
gmake[4]: Entering directory '/home/sushma/rpmbuild/BUILD/wget-1.19.1/64bit/lib'
gmake[4]: Nothing to be done for 'check-am'.
gmake[4]: Leaving directory '/home/sushma/rpmbuild/BUILD/wget-1.19.1/64bit/lib'
gmake[3]: Leaving directory '/home/sushma/rpmbuild/BUILD/wget-1.19.1/64bit/lib'
gmake[2]: Leaving directory '/home/sushma/rpmbuild/BUILD/wget-1.19.1/64bit/lib'
Making check in src
gmake[2]: Entering directory '/home/sushma/rpmbuild/BUILD/wget-1.19.1/64bit/src'
gmake  libunittest.a
gmake[3]: Entering directory '/home/sushma/rpmbuild/BUILD/wget-1.19.1/64bit/src'
  CC       libunittest_a-connect.o
  CC       libunittest_a-convert.o
  CC       libunittest_a-cookies.o
  CC       libunittest_a-ftp.o
  CC       libunittest_a-css_.o
  CC       libunittest_a-css-url.o
  CC       libunittest_a-ftp-basic.o
  CC       libunittest_a-ftp-ls.o
  CC       libunittest_a-hash.o
  CC       libunittest_a-host.o
  CC       libunittest_a-hsts.o
  CC       libunittest_a-html-parse.o
  CC       libunittest_a-html-url.o
  CC       libunittest_a-http.o
  CC       libunittest_a-init.o
  CC       libunittest_a-log.o
  CC       libunittest_a-main.o
  CC       libunittest_a-netrc.o
  CC       libunittest_a-progress.o
  CC       libunittest_a-ptimer.o
  CC       libunittest_a-recur.o
  CC       libunittest_a-res.o
  CC       libunittest_a-retr.o
  CC       libunittest_a-spider.o
  CC       libunittest_a-url.o
  CC       libunittest_a-warc.o
warc.c: In function 'warc_uuid_str':
warc.c:639:31: warning: passing argument 2 of 'uuid_to_string' from incompatible pointer type [-Wincompatible-pointer-types]
   uuid_to_string (&record_id, &uuid_str, NULL);
                               ^
In file included from warc.c:51:0:
/usr/include/uuid.h:109:13: note: expected 'unsigned char **' but argument is of type 'char **'
 extern void uuid_to_string(uuid_p_t uuid, unsigned char **uuid_string, unsigned32 *status);
             ^~~~~~~~~~~~~~
  CC       libunittest_a-utils.o
  CC       libunittest_a-exits.o
  CC       libunittest_a-build_info.o
  CC       libunittest_a-test.o
  CC       libunittest_a-version.o
  AR       libunittest.a
gmake[3]: Leaving directory '/home/sushma/rpmbuild/BUILD/wget-1.19.1/64bit/src'
gmake[2]: Leaving directory '/home/sushma/rpmbuild/BUILD/wget-1.19.1/64bit/src'
Making check in doc
gmake[2]: Entering directory '/home/sushma/rpmbuild/BUILD/wget-1.19.1/64bit/doc'
gmake[2]: Nothing to be done for 'check'.
gmake[2]: Leaving directory '/home/sushma/rpmbuild/BUILD/wget-1.19.1/64bit/doc'
Making check in po
gmake[2]: Entering directory '/home/sushma/rpmbuild/BUILD/wget-1.19.1/64bit/po'
gmake[2]: Nothing to be done for 'check'.
gmake[2]: Leaving directory '/home/sushma/rpmbuild/BUILD/wget-1.19.1/64bit/po'
Making check in tests
gmake[2]: Entering directory '/home/sushma/rpmbuild/BUILD/wget-1.19.1/64bit/tests'
gmake  unit-tests
gmake[3]: Entering directory '/home/sushma/rpmbuild/BUILD/wget-1.19.1/64bit/tests'
cd ../src && gmake  libunittest.a
gmake[4]: Entering directory '/home/sushma/rpmbuild/BUILD/wget-1.19.1/64bit/src'
gmake[4]: Leaving directory '/home/sushma/rpmbuild/BUILD/wget-1.19.1/64bit/src'
  CCLD     unit-tests
gmake[3]: Leaving directory '/home/sushma/rpmbuild/BUILD/wget-1.19.1/64bit/tests'
gmake  check-TESTS
gmake[3]: Entering directory '/home/sushma/rpmbuild/BUILD/wget-1.19.1/64bit/tests'
gmake[4]: Entering directory '/home/sushma/rpmbuild/BUILD/wget-1.19.1/64bit/tests'
cd ../src && gmake  libunittest.a
gmake[5]: Entering directory '/home/sushma/rpmbuild/BUILD/wget-1.19.1/64bit/src'
gmake[5]: Leaving directory '/home/sushma/rpmbuild/BUILD/wget-1.19.1/64bit/src'
  CCLD     unit-tests
PASS: unit-tests
FAIL: Test-auth-basic.px
FAIL: Test-auth-no-challenge.px
FAIL: Test-auth-no-challenge-url.px
FAIL: Test-auth-with-content-disposition.px
FAIL: Test-auth-retcode.px
FAIL: Test-c-full.px
FAIL: Test-c-partial.px
FAIL: Test-c.px
FAIL: Test-c-shorter.px
FAIL: Test-cookies.px
FAIL: Test-cookies-401.px
FAIL: Test-E-k-K.px
FAIL: Test-E-k.px
PASS: Test-ftp.px
PASS: Test-ftp-pasv-fail.px
PASS: Test-ftp-bad-list.px
PASS: Test-ftp-recursive.px
SKIP: Test-ftp-iri.px
SKIP: Test-ftp-iri-fallback.px
SKIP: Test-ftp-iri-recursive.px
SKIP: Test-ftp-iri-disabled.px
PASS: Test-ftp-list-Multinet.px
PASS: Test-ftp-list-Unknown.px
PASS: Test-ftp-list-Unknown-a.px
PASS: Test-ftp-list-Unknown-hidden.px
PASS: Test-ftp-list-Unknown-list-a-fails.px
PASS: Test-ftp-list-UNIX-hidden.px
PASS: Test-ftp--start-pos.px
FAIL: Test-HTTP-Content-Disposition-1.px
FAIL: Test-HTTP-Content-Disposition-2.px
FAIL: Test-HTTP-Content-Disposition.px
PASS: Test-i-ftp.px
FAIL: Test-i-http.px
SKIP: Test-idn-headers.px
SKIP: Test-idn-meta.px
SKIP: Test-idn-cmd.px
SKIP: Test-idn-cmd-utf8.px
SKIP: Test-idn-robots.px
SKIP: Test-idn-robots-utf8.px
SKIP: Test-iri.px
SKIP: Test-iri-percent.px
FAIL: Test-iri-disabled.px
SKIP: Test-iri-forced-remote.px
SKIP: Test-iri-list.px
FAIL: Test-k.px
FAIL: Test-meta-robots.px
FAIL: Test-N-current.px
FAIL: Test-N-HTTP-Content-Disposition.px
FAIL: Test-N--no-content-disposition.px
FAIL: Test-N--no-content-disposition-trivial.px
FAIL: Test-N-no-info.px
FAIL: Test--no-content-disposition.px
FAIL: Test--no-content-disposition-trivial.px
FAIL: Test-N-old.px
FAIL: Test-nonexisting-quiet.px
FAIL: Test-noop.px
FAIL: Test-np.px
FAIL: Test-N.px
FAIL: Test-N-smaller.px
FAIL: Test-O-HTTP-Content-Disposition.px
FAIL: Test-O-nc.px
FAIL: Test-O--no-content-disposition.px
FAIL: Test-O--no-content-disposition-trivial.px
FAIL: Test-O-nonexisting.px
FAIL: Test-O.px
FAIL: Test--post-file.px
FAIL: Test-proxied-https-auth.px
FAIL: Test-proxied-https-auth-keepalive.px
FAIL: Test-proxy-auth-basic.px
FAIL: Test-restrict-ascii.px
FAIL: Test-Restrict-Lowercase.px
FAIL: Test-Restrict-Uppercase.px
FAIL: Test-stdouterr.px
FAIL: Test--spider-fail.px
FAIL: Test--spider.px
FAIL: Test--spider-r-HTTP-Content-Disposition.px
FAIL: Test--spider-r--no-content-disposition.px
FAIL: Test--spider-r--no-content-disposition-trivial.px
FAIL: Test--spider-r.px
FAIL: Test--start-pos.px
FAIL: Test--start-pos--continue.px
FAIL: Test--httpsonly-r.px
FAIL: Test-204.px
PASS: Test-ftp-pasv-not-supported.px
============================================================================
Testsuite summary for wget 1.19.1
============================================================================
# TOTAL: 85
# PASS:  14
# SKIP:  14
# XFAIL: 0
# FAIL:  57
# XPASS: 0
# ERROR: 0
============================================================================
See tests/test-suite.log
Please report to bug-wget@gnu.org
============================================================================
Makefile:1702: recipe for target 'test-suite.log' failed
gmake[4]: *** [test-suite.log] Error 1
gmake[4]: Leaving directory '/home/sushma/rpmbuild/BUILD/wget-1.19.1/64bit/tests'
Makefile:1808: recipe for target 'check-TESTS' failed
gmake[3]: *** [check-TESTS] Error 2
gmake[3]: Leaving directory '/home/sushma/rpmbuild/BUILD/wget-1.19.1/64bit/tests'
Makefile:1881: recipe for target 'check-am' failed
gmake[2]: *** [check-am] Error 2
gmake[2]: Target 'check' not remade because of errors.
gmake[2]: Leaving directory '/home/sushma/rpmbuild/BUILD/wget-1.19.1/64bit/tests'
Making check in util
gmake[2]: Entering directory '/home/sushma/rpmbuild/BUILD/wget-1.19.1/64bit/util'
gmake[2]: Nothing to be done for 'check'.
gmake[2]: Leaving directory '/home/sushma/rpmbuild/BUILD/wget-1.19.1/64bit/util'
Making check in testenv
gmake[2]: Entering directory '/home/sushma/rpmbuild/BUILD/wget-1.19.1/64bit/testenv'
gmake  check-TESTS
gmake[3]: Entering directory '/home/sushma/rpmbuild/BUILD/wget-1.19.1/64bit/testenv'
gmake[4]: Entering directory '/home/sushma/rpmbuild/BUILD/wget-1.19.1/64bit/testenv'
============================================================================
Testsuite summary for wget 1.19.1
============================================================================
# TOTAL: 0
# PASS:  0
# SKIP:  0
# XFAIL: 0
# FAIL:  0
# XPASS: 0
# ERROR: 0
============================================================================
gmake[4]: Leaving directory '/home/sushma/rpmbuild/BUILD/wget-1.19.1/64bit/testenv'
gmake[3]: Leaving directory '/home/sushma/rpmbuild/BUILD/wget-1.19.1/64bit/testenv'
gmake[2]: Leaving directory '/home/sushma/rpmbuild/BUILD/wget-1.19.1/64bit/testenv'
gmake[2]: Entering directory '/home/sushma/rpmbuild/BUILD/wget-1.19.1/64bit'
gmake[2]: Nothing to be done for 'check-am'.
gmake[2]: Leaving directory '/home/sushma/rpmbuild/BUILD/wget-1.19.1/64bit'
Makefile:1454: recipe for target 'check-recursive' failed
gmake[1]: *** [check-recursive] Error 1
gmake[1]: Leaving directory '/home/sushma/rpmbuild/BUILD/wget-1.19.1/64bit'
Makefile:1746: recipe for target 'check' failed
gmake: *** [check] Error 2
+ true
+ cd ../32bit
+ export CC=gcc -maix32 -D_LARGE_FILES
+ export OBJECT_MODE=32
+ ./configure --prefix=/opt/freeware --mandir=/opt/freeware/man --infodir=/opt/freeware/info --enable-largefile --enable-opie --enable-digest --enable-nls --disable-ipv6 --disable-rpath --with-libidn=/opt/freeware --with-libiconv-prefix=/opt/freeware --with-ssl=openssl --with-libssl-prefix=/usr --disable-pcre
configure: configuring for GNU Wget 1.19.1
checking for a BSD-compatible install... /opt/freeware/bin/install -c
checking whether build environment is sane... yes
checking for a thread-safe mkdir -p... /opt/freeware/bin/mkdir -p
checking for gawk... no
checking for mawk... no
checking for nawk... nawk
checking whether make sets $(MAKE)... yes
checking whether make supports nested variables... yes
checking build system type... powerpc-ibm-aix6.1.9.0
checking host system type... powerpc-ibm-aix6.1.9.0
checking whether make supports nested variables... (cached) yes
checking for gcc... gcc -maix32 -D_LARGE_FILES
checking whether the C compiler works... yes
checking for C compiler default output file name... a.out
checking for suffix of executables... 
checking whether we are cross compiling... no
checking for suffix of object files... o
checking whether we are using the GNU C compiler... yes
checking whether gcc -maix32 -D_LARGE_FILES accepts -g... yes
checking for gcc -maix32 -D_LARGE_FILES option to accept ISO C89... none needed
checking whether gcc -maix32 -D_LARGE_FILES understands -c and -o together... yes
checking for style of include used by make... GNU
checking dependency style of gcc -maix32 -D_LARGE_FILES... gcc3
checking how to run the C preprocessor... gcc -maix32 -D_LARGE_FILES -E
checking for grep that handles long lines and -e... /opt/freeware/bin/grep
checking for egrep... /opt/freeware/bin/grep -E
checking for ANSI C header files... yes
checking for sys/types.h... yes
checking for sys/stat.h... yes
checking for stdlib.h... yes
checking for string.h... yes
checking for memory.h... yes
checking for strings.h... yes
checking for inttypes.h... yes
checking for stdint.h... yes
checking for unistd.h... yes
checking minix/config.h usability... no
checking minix/config.h presence... no
checking for minix/config.h... no
checking whether it is safe to define __EXTENSIONS__... yes
checking whether _XOPEN_SOURCE should be defined... no
checking for Minix Amsterdam compiler... no
checking the archiver (/usr/bin/ar -X32_64) interface... ar
checking for ar... /usr/bin/ar -X32_64
checking for ranlib... ranlib
checking for _LARGEFILE_SOURCE value needed for large files... no
checking for special C compiler options needed for large files... no
checking for _FILE_OFFSET_BITS value needed for large files... no
checking for a Python interpreter with version >= 3.0... none
checking for a sed that does not truncate output... /opt/freeware/bin/sed
checking whether NLS is requested... yes
checking for msgfmt... /opt/freeware/bin/msgfmt
checking for gmsgfmt... /opt/freeware/bin/msgfmt
checking for xgettext... /opt/freeware/bin/xgettext
checking for msgmerge... /opt/freeware/bin/msgmerge
checking for ld used by gcc -maix32 -D_LARGE_FILES... /usr/bin/ld
checking if the linker (/usr/bin/ld) is GNU ld... no
checking for shared library run path origin... done
checking for CFPreferencesCopyAppValue... no
checking for CFLocaleCopyCurrent... no
checking for GNU gettext in libc... no
checking for iconv... yes
checking for working iconv... no
checking for GNU gettext in libintl... yes
checking whether to use NLS... yes
checking where the gettext function comes from... external libintl
checking how to link with libintl... /opt/freeware/lib/libintl.a -liconv -lc
checking for ranlib... (cached) ranlib
checking for flex... no
checking for lex... lex
checking lex output file root... lex.yy
checking lex library... -ll
checking whether yytext is a pointer... no
checking for an ANSI C-conforming const... yes
checking for inline... inline
checking for working volatile... yes
checking for ANSI C header files... (cached) yes
checking for special C compiler options needed for large files... (cached) no
checking for _FILE_OFFSET_BITS value needed for large files... (cached) no
checking size of off_t... 8
checking for stdbool.h that conforms to C99... yes
checking for _Bool... yes
checking for unistd.h... (cached) yes
checking sys/time.h usability... yes
checking sys/time.h presence... yes
checking for sys/time.h... yes
checking termios.h usability... yes
checking termios.h presence... yes
checking for termios.h... yes
checking sys/ioctl.h usability... yes
checking sys/ioctl.h presence... yes
checking for sys/ioctl.h... yes
checking sys/select.h usability... yes
checking sys/select.h presence... yes
checking for sys/select.h... yes
checking utime.h usability... yes
checking utime.h presence... yes
checking for utime.h... yes
checking sys/utime.h usability... no
checking sys/utime.h presence... no
checking for sys/utime.h... no
checking for stdint.h... (cached) yes
checking for inttypes.h... (cached) yes
checking pwd.h usability... yes
checking pwd.h presence... yes
checking for pwd.h... yes
checking wchar.h usability... yes
checking wchar.h presence... yes
checking for wchar.h... yes
checking whether h_errno is declared... yes
checking size of short... 2
checking size of int... 4
checking size of long... 4
checking size of long long... 8
checking size of void *... 4
checking for size_t... yes
checking for pid_t... yes
checking for uint32_t... yes
checking for uintptr_t... yes
checking for intptr_t... yes
checking for int64_t... yes
checking for sig_atomic_t... yes
checking for sys/socket.h... yes
checking for arpa/inet.h... yes
checking for features.h... no
checking for unistd.h... (cached) yes
checking for wctype.h... yes
checking for sys/stat.h... (cached) yes
checking for netdb.h... yes
checking for netinet/in.h... yes
checking for getopt.h... no
checking for stdio_ext.h... no
checking for termios.h... (cached) yes
checking for sys/time.h... (cached) yes
checking for iconv.h... yes
checking for limits.h... yes
checking for wchar.h... (cached) yes
checking for stdint.h... (cached) yes
checking for inttypes.h... (cached) yes
checking for langinfo.h... yes
checking for xlocale.h... no
checking for sys/mman.h... yes
checking for sys/select.h... (cached) yes
checking for sys/param.h... yes
checking for malloc.h... yes
checking for sys/cdefs.h... yes
checking for spawn.h... yes
checking for strings.h... (cached) yes
checking for sys/file.h... yes
checking for sys/ioctl.h... (cached) yes
checking for sys/uio.h... yes
checking for sys/wait.h... yes
checking for utime.h... (cached) yes
checking for stdlib.h... (cached) yes
checking whether the preprocessor supports include_next... yes
checking whether system header files limit the line length... no
checking whether <sys/socket.h> is self-contained... yes
checking for shutdown... yes
checking whether <sys/socket.h> defines the SHUT_* macros... yes
checking for struct sockaddr_storage... yes
checking for sa_family_t... yes
checking for struct sockaddr_storage.ss_family... yes
checking whether socket is declared without a macro... yes
checking whether connect is declared without a macro... yes
checking whether accept is declared without a macro... no
checking whether bind is declared without a macro... yes
checking whether getpeername is declared without a macro... no
checking whether getsockname is declared without a macro... no
checking whether getsockopt is declared without a macro... yes
checking whether listen is declared without a macro... yes
checking whether recv is declared without a macro... yes
checking whether send is declared without a macro... yes
checking whether recvfrom is declared without a macro... no
checking whether sendto is declared without a macro... yes
checking whether setsockopt is declared without a macro... yes
checking whether shutdown is declared without a macro... yes
checking whether accept4 is declared without a macro... no
checking for working alloca.h... yes
checking for alloca... yes
checking for C/C++ restrict keyword... __restrict
checking whether <wchar.h> uses 'inline' correctly... yes
checking for btowc... yes
checking for _set_invalid_parameter_handler... no
checking for fcntl... yes
checking for symlink... yes
checking for flock... no
checking for isblank... yes
checking for iswctype... yes
checking for mbsrtowcs... yes
checking for mempcpy... no
checking for wmemchr... yes
checking for wmemcpy... yes
checking for wmempcpy... no
checking for futimens... no
checking for getdelim... yes
checking for getdtablesize... yes
checking for __fsetlocking... no
checking for tcgetattr... yes
checking for tcsetattr... yes
checking for getprogname... no
checking for getexecname... no
checking for gettimeofday... yes
checking for nanotime... no
checking for iswcntrl... yes
checking for iswblank... yes
checking for link... yes
checking for lstat... yes
checking for mbsinit... yes
checking for mbrtowc... yes
checking for mprotect... yes
checking for mkostemp... no
checking for mkstemp... yes
checking for tzset... yes
checking for nl_langinfo... yes
checking for pipe... yes
checking for pipe2... no
checking for secure_getenv... no
checking for getuid... yes
checking for geteuid... yes
checking for getgid... yes
checking for getegid... yes
checking for sigaction... yes
checking for sigaltstack... yes
checking for siginterrupt... yes
checking for snprintf... yes
checking for strdup... yes
checking for __xpg_strerror_r... no
checking for catgets... yes
checking for strndup... yes
checking for strptime... yes
checking for localtime_r... yes
checking for timegm... no
checking for futimes... no
checking for futimesat... no
checking for utimensat... no
checking for lutimes... no
checking for vasnprintf... no
checking for wcrtomb... yes
checking for wcwidth... yes
checking for nl_langinfo and CODESET... yes
checking for a traditional french locale... fr_FR
checking whether byte ordering is bigendian... yes
checking whether // is distinct from /... no
checking if environ is properly declared... yes
checking for complete errno.h... yes
checking for sig_atomic_t... (cached) yes
checking for working fcntl.h... no (bad O_NOATIME, O_NOFOLLOW)
checking for mode_t... yes
checking for mbstate_t... yes
checking whether stdin defaults to large file offsets... yes
checking whether fseeko is declared... yes
checking for fseeko... yes
checking whether stat file-mode macros are broken... no
checking for nlink_t... yes
checking whether fchmodat is declared without a macro... no
checking whether fstat is declared without a macro... no
checking whether fstatat is declared without a macro... no
checking whether futimens is declared without a macro... no
checking whether lchmod is declared without a macro... no
checking whether lstat is declared without a macro... no
checking whether mkdirat is declared without a macro... no
checking whether mkfifo is declared without a macro... yes
checking whether mkfifoat is declared without a macro... no
checking whether mknod is declared without a macro... yes
checking whether mknodat is declared without a macro... no
checking whether stat is declared without a macro... no
checking whether utimensat is declared without a macro... no
checking whether ftello is declared... yes
checking for ftello... yes
checking whether ftello works... yes
checking whether getaddrinfo is declared without a macro... yes
checking whether freeaddrinfo is declared without a macro... yes
checking whether gai_strerror is declared without a macro... yes
checking whether getnameinfo is declared without a macro... yes
checking for library containing gethostbyname... none required
checking for gethostbyname... yes
checking for library containing getservbyname... none required
checking for getservbyname... yes
checking for library containing inet_ntop... none required
checking whether inet_ntop is declared... yes
checking for IPv4 sockets... yes
checking for IPv6 sockets... yes
checking whether getdelim is declared... no
checking whether getdtablesize is declared... yes
checking whether getline is declared... no
checking for getopt.h... (cached) no
checking whether getenv is declared... yes
checking whether getpass is declared... yes
checking whether fflush_unlocked is declared... no
checking whether flockfile is declared... yes
checking whether fputs_unlocked is declared... no
checking whether funlockfile is declared... yes
checking whether putc_unlocked is declared... yes
checking for struct timeval... yes
checking for wide-enough struct timeval.tv_sec member... yes
checking whether gettimeofday is declared without a macro... yes
checking for iconv... (cached) yes
checking for working iconv... (cached) no
checking for iconv declaration... 
         extern size_t iconv (iconv_t cd, char * *inbuf, size_t *inbytesleft, char * *outbuf, size_t *outbytesleft);
checking whether limits.h has ULLONG_WIDTH etc.... no
checking for wint_t... yes
checking whether wint_t is too small... no
checking for unsigned long long int... yes
checking for long long int... yes
checking whether stdint.h conforms to C99... yes
checking whether stdint.h predates C++11... no
checking whether stdint.h has UINTMAX_WIDTH etc.... no
checking whether imaxabs is declared without a macro... yes
checking whether imaxdiv is declared without a macro... yes
checking whether strtoimax is declared without a macro... yes
checking whether strtoumax is declared without a macro... yes
checking for inttypes.h... (cached) yes
checking whether the inttypes.h PRIxNN macros are broken... no
checking whether iswcntrl works... yes
checking for towlower... yes
checking for wctype_t... yes
checking for wctrans_t... yes
checking whether wctype is declared without a macro... yes
checking whether iswctype is declared without a macro... yes
checking whether wctrans is declared without a macro... yes
checking whether towctrans is declared without a macro... yes
checking whether included libunistring is requested... no
checking for libunistring... no, consider installing GNU libunistring
checking whether getc_unlocked is declared... yes
checking whether we are using the GNU C Library >= 2.1 or uClibc... no
checking for wchar_t... yes
checking for max_align_t... yes
checking whether NULL can be used in arbitrary expressions... yes
checking whether imported symbols can be declared weak... no
checking pthread.h usability... yes
checking pthread.h presence... yes
checking for pthread.h... yes
checking for multithread API to use... posix
checking whether lstat correctly handles trailing slash... no
checking whether malloc, realloc, calloc are POSIX compliant... yes
checking for a traditional japanese locale... ja_JP
checking for a transitional chinese locale... none
checking for a french Unicode locale... none
checking for mmap... yes
checking for MAP_ANONYMOUS... yes
checking whether memchr works... yes
checking whether memrchr is declared... no
checking whether <limits.h> defines MIN and MAX... no
checking whether <sys/param.h> defines MIN and MAX... yes
checking whether time_t is signed... yes
checking whether alarm is declared... yes
checking whether <sys/select.h> is self-contained... no
checking whether pselect is declared without a macro... yes
checking whether select is declared without a macro... yes
checking for library containing setsockopt... none needed
checking whether select supports a 0 argument... yes
checking whether select detects invalid fds... yes
checking for promoted mode_t type... mode_t
checking for library containing posix_spawn... none required
checking for posix_spawn... yes
checking whether posix_spawn works... yes
checking whether posix_spawnattr_setschedpolicy is supported... yes
checking whether posix_spawnattr_setschedparam is supported... yes
checking for sigset_t... yes
checking for SIGPIPE... yes
checking for stdlib.h... (cached) yes
checking for GNU libc compatible malloc... no
checking for uid_t in sys/types.h... yes
checking whether C symbols are prefixed with underscore at the linker level... no
checking whether snprintf returns a byte count as in C99... yes
checking whether snprintf is declared... yes
checking whether strdup is declared... yes
checking whether strerror(0) succeeds... yes
checking for strerror_r... yes
checking for strerror_r with POSIX signature... yes
checking whether strerror_r works... no
checking whether ffsl is declared without a macro... no
checking whether ffsll is declared without a macro... no
checking whether memmem is declared without a macro... yes
checking whether mempcpy is declared without a macro... no
checking whether memrchr is declared without a macro... no
checking whether rawmemchr is declared without a macro... no
checking whether stpcpy is declared without a macro... yes
checking whether stpncpy is declared without a macro... yes
checking whether strchrnul is declared without a macro... no
checking whether strdup is declared without a macro... yes
checking whether strncat is declared without a macro... yes
checking whether strndup is declared without a macro... yes
checking whether strnlen is declared without a macro... yes
checking whether strpbrk is declared without a macro... yes
checking whether strsep is declared without a macro... yes
checking whether strcasestr is declared without a macro... no
checking whether strtok_r is declared without a macro... yes
checking whether strerror_r is declared without a macro... yes
checking whether strsignal is declared without a macro... yes
checking whether strverscmp is declared without a macro... no
checking whether ffs is declared without a macro... yes
checking whether strcasecmp is declared without a macro... yes
checking whether strncasecmp is declared without a macro... yes
checking whether strndup is declared... (cached) yes
checking whether strnlen is declared... (cached) yes
checking for struct tm.tm_gmtoff... no
checking whether strtok_r is declared... (cached) yes
checking for struct timespec in <time.h>... yes
checking whether clearerr_unlocked is declared... yes
checking whether feof_unlocked is declared... yes
checking whether ferror_unlocked is declared... yes
checking whether fgets_unlocked is declared... no
checking whether fputc_unlocked is declared... no
checking whether fread_unlocked is declared... no
checking whether fwrite_unlocked is declared... no
checking whether getchar_unlocked is declared... yes
checking whether putchar_unlocked is declared... yes
checking whether the utimes function works... yes
checking for struct utimbuf... yes
checking for inttypes.h... yes
checking for stdint.h... yes
checking for intmax_t... yes
checking where to find the exponent in a 'double'... word 0 bit 20
checking for snprintf... (cached) yes
checking for strnlen... yes
checking for wcslen... yes
checking for wcsnlen... yes
checking for mbrtowc... (cached) yes
checking for wcrtomb... (cached) yes
checking whether _snprintf is declared... no
checking whether vsnprintf is declared... yes
checking for alloca as a compiler built-in... yes
checking whether inet_ntop is declared without a macro... yes
checking whether inet_pton is declared without a macro... yes
checking whether btowc(0) is correct... yes
checking whether btowc(EOF) is correct... yes
checking for __builtin_expect... yes
checking for library containing clock_gettime... none required
checking for clock_gettime... yes
checking for clock_settime... yes
checking whether // is distinct from /... (cached) no
checking whether dup2 works... yes
checking for error_at_line... no
checking whether fcntl handles F_DUPFD correctly... yes
checking whether fcntl understands F_DUPFD_CLOEXEC... no
checking whether fcntl is declared without a macro... yes
checking whether openat is declared without a macro... no
checking for flexible array member... yes
checking whether conversion from 'int' to 'long double' works... yes
checking for struct flock.l_type... yes
checking for working POSIX fnmatch... yes
checking whether fopen recognizes a trailing slash... no
checking for fseeko... (cached) yes
checking for ftello... (cached) yes
checking whether ftello works... (cached) yes
checking how to do getaddrinfo, freeaddrinfo and getnameinfo... checking for library containing getaddrinfo... none required
checking for getaddrinfo... yes
checking whether gai_strerror is declared... (cached) yes
checking whether gai_strerrorA is declared... no
checking for gai_strerror with POSIX signature... no
checking for struct sockaddr.sa_len... yes
checking whether getaddrinfo is declared... (cached) yes
checking whether freeaddrinfo is declared... (cached) yes
checking whether getnameinfo is declared... (cached) yes
checking for struct addrinfo... yes
checking for working getdelim function... no
checking for flockfile... yes
checking for funlockfile... yes
checking whether getc_unlocked is declared... (cached) yes
checking whether getdtablesize works... yes
checking for getline... yes
checking for working getline function... no
checking whether __fsetlocking is declared... no
checking whether program_invocation_name is declared... no
checking whether program_invocation_short_name is declared... no
checking whether __argv is declared... no
checking whether __progname is defined in default libraries... 
checking whether gettimeofday clobbers localtime buffer... no
checking for gettimeofday with POSIX signature... yes
checking for library containing gethostbyname... (cached) none required
checking for gethostbyname... (cached) yes
checking for library containing inet_ntop... (cached) none required
checking whether inet_ntop is declared... (cached) yes
checking whether the compiler generally respects inline... no
checking whether INT32_MAX < INTMAX_MAX... yes
checking whether INT64_MAX == LONG_MAX... no
checking whether UINT32_MAX < UINTMAX_MAX... yes
checking whether UINT64_MAX == ULONG_MAX... no
checking for ioctl... yes
checking for ioctl with POSIX signature... yes
checking whether iswblank is declared... yes
checking whether langinfo.h defines CODESET... yes
checking whether langinfo.h defines T_FMT_AMPM... yes
checking whether langinfo.h defines ERA... yes
checking whether langinfo.h defines YESEXPR... yes
checking whether nl_langinfo is declared without a macro... yes
checking whether to use the included libunistring... yes
checking whether link obeys POSIX... no
checking whether locale.h conforms to POSIX:2001... yes
checking whether struct lconv is properly defined... yes
checking whether setlocale is declared without a macro... yes
checking whether duplocale is declared without a macro... no
checking for pthread_rwlock_t... yes
checking whether pthread_rwlock_rdlock prefers a writer to a reader... no
checking whether lseek detects pipes... yes
checking whether mbrtowc handles incomplete characters... no
checking whether mbrtowc works as well as mbtowc... guessing yes
checking whether mbrtowc handles incomplete characters... (cached) no
checking whether mbrtowc works as well as mbtowc... (cached) guessing yes
checking whether mbrtowc handles incomplete characters... (cached) no
checking whether mbrtowc works as well as mbtowc... (cached) guessing yes
checking for memrchr... no
checking whether mkdir handles trailing slash... yes
checking whether mkdir handles trailing dot... yes
checking for working mkstemp... yes
checking for working mktime... no
checking for library containing nanosleep... none required
checking for working nanosleep... yes
checking whether getaddrinfo is declared without a macro... (cached) yes
checking whether freeaddrinfo is declared without a macro... (cached) yes
checking whether gai_strerror is declared without a macro... (cached) yes
checking whether getnameinfo is declared without a macro... (cached) yes
checking whether <netinet/in.h> is self-contained... yes
checking whether YESEXPR works... yes
checking whether open recognizes a trailing slash... no
checking whether posix_spawn_file_actions_addclose works... yes
checking whether posix_spawn_file_actions_adddup2 works... yes
checking whether posix_spawn_file_actions_addopen works... yes
checking for raise... yes
checking for sigprocmask... yes
checking for rawmemchr... no
checking for working re_compile_pattern... no
checking libintl.h usability... yes
checking libintl.h presence... yes
checking for libintl.h... yes
checking whether isblank is declared... yes
checking for __secure_getenv... no
checking for issetugid... no
checking whether select supports a 0 argument... (cached) yes
checking whether select detects invalid fds... (cached) yes
checking for library containing getservbyname... (cached) none required
checking for getservbyname... (cached) yes
checking for struct sigaction.sa_sigaction... yes
checking for volatile sig_atomic_t... yes
checking for sighandler_t... no
checking whether pthread_sigmask is declared without a macro... yes
checking whether sigaction is declared without a macro... yes
checking whether sigaddset is declared without a macro... yes
checking whether sigdelset is declared without a macro... yes
checking whether sigemptyset is declared without a macro... yes
checking whether sigfillset is declared without a macro... yes
checking whether sigismember is declared without a macro... yes
checking whether sigpending is declared without a macro... yes
checking whether sigprocmask is declared without a macro... yes
checking for sigprocmask... (cached) yes
checking for stdint.h... (cached) yes
checking for SIZE_MAX... yes
checking for snprintf... (cached) yes
checking whether snprintf respects a size of 1... yes
checking whether printf supports POSIX/XSI format strings with positions... yes
checking for socklen_t... yes
checking for posix_spawnattr_t... yes
checking for posix_spawn_file_actions_t... yes
checking whether posix_spawn is declared without a macro... yes
checking whether posix_spawnp is declared without a macro... yes
checking whether posix_spawnattr_init is declared without a macro... yes
checking whether posix_spawnattr_destroy is declared without a macro... yes
checking whether posix_spawnattr_getsigdefault is declared without a macro... yes
checking whether posix_spawnattr_setsigdefault is declared without a macro... yes
checking whether posix_spawnattr_getsigmask is declared without a macro... yes
checking whether posix_spawnattr_setsigmask is declared without a macro... yes
checking whether posix_spawnattr_getflags is declared without a macro... yes
checking whether posix_spawnattr_setflags is declared without a macro... yes
checking whether posix_spawnattr_getpgroup is declared without a macro... yes
checking whether posix_spawnattr_setpgroup is declared without a macro... yes
checking whether posix_spawnattr_getschedpolicy is declared without a macro... yes
checking whether posix_spawnattr_setschedpolicy is declared without a macro... yes
checking whether posix_spawnattr_getschedparam is declared without a macro... yes
checking whether posix_spawnattr_setschedparam is declared without a macro... yes
checking whether posix_spawn_file_actions_init is declared without a macro... yes
checking whether posix_spawn_file_actions_destroy is declared without a macro... yes
checking whether posix_spawn_file_actions_addopen is declared without a macro... yes
checking whether posix_spawn_file_actions_addclose is declared without a macro... yes
checking whether posix_spawn_file_actions_adddup2 is declared without a macro... yes
checking for ssize_t... yes
checking whether stat handles trailing slashes on directories... yes
checking whether stat handles trailing slashes on files... no
checking for struct stat.st_atim.tv_nsec... no
checking for struct stat.st_atimespec.tv_nsec... no
checking for struct stat.st_atimensec... no
checking for struct stat.st_atim.st__tim.tv_nsec... no
checking for struct stat.st_birthtimespec.tv_nsec... no
checking for struct stat.st_birthtimensec... no
checking for struct stat.st_birthtim.tv_nsec... no
checking for working stdalign.h... yes
checking for max_align_t... (cached) yes
checking whether NULL can be used in arbitrary expressions... (cached) yes
checking which flavor of printf attribute matches inttypes macros... system
checking whether dprintf is declared without a macro... no
checking whether fpurge is declared without a macro... no
checking whether fseeko is declared without a macro... no
checking whether ftello is declared without a macro... no
checking whether getdelim is declared without a macro... no
checking whether getline is declared without a macro... no
checking whether gets is declared without a macro... yes
checking whether pclose is declared without a macro... yes
checking whether popen is declared without a macro... yes
checking whether renameat is declared without a macro... no
checking whether snprintf is declared without a macro... yes
checking whether tmpfile is declared without a macro... yes
checking whether vdprintf is declared without a macro... no
checking whether vsnprintf is declared without a macro... yes
checking whether _Exit is declared without a macro... yes
checking whether atoll is declared without a macro... yes
checking whether canonicalize_file_name is declared without a macro... no
checking whether getloadavg is declared without a macro... no
checking whether getsubopt is declared without a macro... yes
checking whether grantpt is declared without a macro... yes
checking whether initstate is declared without a macro... yes
checking whether initstate_r is declared without a macro... yes
checking whether mkdtemp is declared without a macro... no
checking whether mkostemp is declared without a macro... no
checking whether mkostemps is declared without a macro... no
checking whether mkstemp is declared without a macro... yes
checking whether mkstemps is declared without a macro... no
checking whether posix_openpt is declared without a macro... yes
checking whether ptsname is declared without a macro... yes
checking whether ptsname_r is declared without a macro... no
checking whether qsort_r is declared without a macro... no
checking whether random is declared without a macro... yes
checking whether random_r is declared without a macro... yes
checking whether realpath is declared without a macro... yes
checking whether rpmatch is declared without a macro... yes
checking whether secure_getenv is declared without a macro... no
checking whether setenv is declared without a macro... yes
checking whether setstate is declared without a macro... yes
checking whether setstate_r is declared without a macro... yes
checking whether srandom is declared without a macro... yes
checking whether srandom_r is declared without a macro... yes
checking whether strtod is declared without a macro... yes
checking whether strtoll is declared without a macro... yes
checking whether strtoull is declared without a macro... yes
checking whether unlockpt is declared without a macro... yes
checking whether unsetenv is declared without a macro... yes
checking for strcasecmp... yes
checking for strncasecmp... yes
checking whether strncasecmp is declared... (cached) yes
checking for strchrnul... no
checking for working strerror function... yes
checking whether strerror_r is declared... (cached) yes
checking for working strndup... yes
checking for working strnlen... yes
checking for strpbrk... yes
checking for strtok_r... yes
checking whether strtok_r works... yes
checking for strtoll... yes
checking whether symlink handles trailing slash correctly... no
checking whether flock is declared without a macro... yes
checking whether <sys/ioctl.h> declares ioctl... no
checking whether ioctl is declared without a macro... yes
checking whether <sys/select.h> is self-contained... (cached) no
checking whether pselect is declared without a macro... (cached) yes
checking whether select is declared without a macro... (cached) yes
checking for nlink_t... (cached) yes
checking whether fchmodat is declared without a macro... (cached) no
checking whether fstat is declared without a macro... (cached) no
checking whether fstatat is declared without a macro... (cached) no
checking whether futimens is declared without a macro... (cached) no
checking whether lchmod is declared without a macro... (cached) no
checking whether lstat is declared without a macro... (cached) no
checking whether mkdirat is declared without a macro... (cached) no
checking whether mkfifo is declared without a macro... (cached) yes
checking whether mkfifoat is declared without a macro... (cached) no
checking whether mknod is declared without a macro... (cached) yes
checking whether mknodat is declared without a macro... (cached) no
checking whether stat is declared without a macro... (cached) no
checking whether utimensat is declared without a macro... (cached) no
checking whether waitpid is declared without a macro... yes
checking whether localtime_r is declared... yes
checking whether localtime_r is compatible with its POSIX signature... yes
checking whether chdir is declared without a macro... yes
checking whether chown is declared without a macro... yes
checking whether dup is declared without a macro... yes
checking whether dup2 is declared without a macro... yes
checking whether dup3 is declared without a macro... no
checking whether environ is declared without a macro... yes
checking whether euidaccess is declared without a macro... no
checking whether faccessat is declared without a macro... no
checking whether fchdir is declared without a macro... yes
checking whether fchownat is declared without a macro... no
checking whether fdatasync is declared without a macro... yes
checking whether fsync is declared without a macro... yes
checking whether ftruncate is declared without a macro... no
checking whether getcwd is declared without a macro... yes
checking whether getdomainname is declared without a macro... no
checking whether getdtablesize is declared without a macro... yes
checking whether getgroups is declared without a macro... yes
checking whether gethostname is declared without a macro... yes
checking whether getlogin is declared without a macro... yes
checking whether getlogin_r is declared without a macro... yes
checking whether getpagesize is declared without a macro... yes
checking whether getusershell is declared without a macro... yes
checking whether setusershell is declared without a macro... yes
checking whether endusershell is declared without a macro... yes
checking whether group_member is declared without a macro... no
checking whether isatty is declared without a macro... yes
checking whether lchown is declared without a macro... yes
checking whether link is declared without a macro... yes
checking whether linkat is declared without a macro... no
checking whether lseek is declared without a macro... no
checking whether pipe is declared without a macro... yes
checking whether pipe2 is declared without a macro... no
checking whether pread is declared without a macro... no
checking whether pwrite is declared without a macro... no
checking whether readlink is declared without a macro... yes
checking whether readlinkat is declared without a macro... no
checking whether rmdir is declared without a macro... yes
checking whether sethostname is declared without a macro... no
checking whether sleep is declared without a macro... yes
checking whether symlink is declared without a macro... yes
checking whether symlinkat is declared without a macro... no
checking whether ttyname_r is declared without a macro... yes
checking whether unlink is declared without a macro... yes
checking whether unlinkat is declared without a macro... no
checking whether usleep is declared without a macro... yes
checking whether unlink honors trailing slashes... no
checking whether unlink of a parent directory fails as it should... guessing yes
checking for ptrdiff_t... yes
checking for vasprintf... no
checking for vsnprintf... yes
checking whether snprintf respects a size of 1... (cached) yes
checking whether printf supports POSIX/XSI format strings with positions... (cached) yes
checking for waitid... yes
checking whether btowc is declared without a macro... yes
checking whether wctob is declared without a macro... yes
checking whether mbsinit is declared without a macro... yes
checking whether mbrtowc is declared without a macro... yes
checking whether mbrlen is declared without a macro... yes
checking whether mbsrtowcs is declared without a macro... yes
checking whether mbsnrtowcs is declared without a macro... yes
checking whether wcrtomb is declared without a macro... yes
checking whether wcsrtombs is declared without a macro... yes
checking whether wcsnrtombs is declared without a macro... yes
checking whether wcwidth is declared without a macro... yes
checking whether wmemchr is declared without a macro... yes
checking whether wmemcmp is declared without a macro... yes
checking whether wmemcpy is declared without a macro... yes
checking whether wmemmove is declared without a macro... yes
checking whether wmemset is declared without a macro... yes
checking whether wcslen is declared without a macro... yes
checking whether wcsnlen is declared without a macro... yes
checking whether wcscpy is declared without a macro... yes
checking whether wcpcpy is declared without a macro... yes
checking whether wcsncpy is declared without a macro... yes
checking whether wcpncpy is declared without a macro... yes
checking whether wcscat is declared without a macro... yes
checking whether wcsncat is declared without a macro... yes
checking whether wcscmp is declared without a macro... yes
checking whether wcsncmp is declared without a macro... yes
checking whether wcscasecmp is declared without a macro... yes
checking whether wcsncasecmp is declared without a macro... yes
checking whether wcscoll is declared without a macro... yes
checking whether wcsxfrm is declared without a macro... yes
checking whether wcsdup is declared without a macro... yes
checking whether wcschr is declared without a macro... yes
checking whether wcsrchr is declared without a macro... yes
checking whether wcscspn is declared without a macro... yes
checking whether wcsspn is declared without a macro... yes
checking whether wcspbrk is declared without a macro... yes
checking whether wcsstr is declared without a macro... yes
checking whether wcstok is declared without a macro... yes
checking whether wcswidth is declared without a macro... yes
checking whether mbrtowc handles incomplete characters... (cached) no
checking whether mbrtowc works as well as mbtowc... (cached) guessing yes
checking whether iswcntrl works... (cached) yes
checking for towlower... (cached) yes
checking for wctype_t... (cached) yes
checking for wctrans_t... (cached) yes
checking whether wctype is declared without a macro... (cached) yes
checking whether iswctype is declared without a macro... (cached) yes
checking whether wctrans is declared without a macro... (cached) yes
checking whether towctrans is declared without a macro... (cached) yes
checking whether wcwidth is declared... (cached) yes
checking whether wcwidth works reasonably in UTF-8 locales... yes
checking for stdint.h... (cached) yes
checking for getpagesize... yes
checking for working mmap... yes
checking for _LARGEFILE_SOURCE value needed for large files... (cached) no
checking for strptime... (cached) yes
checking for timegm... (cached) no
checking for vsnprintf... (cached) yes
checking for vasprintf... (cached) no
checking for drand48... yes
checking for pathconf... yes
checking for strtoll... (cached) yes
checking for usleep... yes
checking for ftello... yes
checking for sigblock... yes
checking for sigsetjmp... yes
checking for memrchr... (cached) no
checking for wcwidth... (cached) yes
checking for mbtowc... yes
checking for sleep... yes
checking for symlink... (cached) yes
checking for utime... yes
checking for strlcpy... no
checking for random... yes
checking for pkg-config... /opt/freeware/bin/pkg-config
checking pkg-config is at least version 0.9.0... yes
checking for LIBPSL... no
checking for library containing psl_builtin... no
configure: WARNING: *** libpsl was not found. Fallback to builtin cookie checking.
checking for ZLIB... yes
checking for dlopen in -ldl... yes
checking for libssl... yes
checking how to link with libssl... /usr/lib/libssl.a /usr/lib/libcrypto.a
configure: compiling in support for SSL via OpenSSL
checking for RAND_egd... yes
checking for METALINK... no
configure: disabling IPv6 at user request
checking for makeinfo... ${SHELL} /home/sushma/rpmbuild/BUILD/wget-1.19.1/32bit/build-aux/missing makeinfo
checking for perl5... no
checking for perl... /opt/freeware/bin/perl
checking for pod2man... /opt/freeware/bin/pod2man
checking for library containing idn2_lookup_u8... no
configure: WARNING: *** LIBIDN2 was not found. You will not be able to use IDN2008 support
checking uuid.h usability... yes
checking uuid.h presence... yes
checking for uuid.h... yes
checking for uuid_create... yes
configure: Disabling Extended Attribute support: your system is not known to support extended attributes.
checking that generated files are newer than configure... done
configure: creating ./config.status
config.status: creating Makefile
config.status: creating src/Makefile
config.status: creating doc/Makefile
config.status: creating util/Makefile
config.status: creating po/Makefile.in
config.status: creating tests/Makefile
config.status: creating lib/Makefile
config.status: creating testenv/Makefile
config.status: creating src/config.h
config.status: executing depfiles commands
config.status: executing po-directories commands
config.status: creating po/POTFILES
config.status: creating po/Makefile
configure: Summary of build options:

  Version:           1.19.1
  Host OS:           aix6.1.9.0
  Install prefix:    /opt/freeware
  Compiler:          gcc -maix32 -D_LARGE_FILES
  CFlags:            -I/opt/freeware/include   -DNDEBUG   -D_THREAD_SAFE -I/opt/freeware/include
  LDFlags:           
  Libs:              /usr/lib/libssl.a /usr/lib/libcrypto.a -ldl -L/opt/freeware/lib -lz   
  SSL:               openssl
  Zlib:              yes
  PSL:               no
  Digest:            yes
  NTLM:              yes
  OPIE:              yes
  POSIX xattr:       no
  Debugging:         yes
  Assertions:        no
  Valgrind:          Valgrind testing not enabled
  Metalink:          no
  Resolver:          libc, --bind-dns-address and --dns-servers not available
  GPGME:             no
  IRI:               no

+ make
echo 1.19.1 > .version-t && mv .version-t .version
make  all-recursive
make[1]: Entering directory '/home/sushma/rpmbuild/BUILD/wget-1.19.1/32bit'
Making all in lib
make[2]: Entering directory '/home/sushma/rpmbuild/BUILD/wget-1.19.1/32bit/lib'
  GEN      alloca.h
  GEN      c++defs.h
  GEN      warn-on-use.h
  GEN      arg-nonnull.h
  GEN      arpa/inet.h
  GEN      configmake.h
  GEN      fcntl.h
  GEN      float.h
  GEN      getopt.h
  GEN      inttypes.h
  GEN      langinfo.h
  GEN      limits.h
  GEN      locale.h
  GEN      netdb.h
  GEN      signal.h
  GEN      unused-parameter.h
  GEN      spawn.h
  GEN      stdint.h
  GEN      stdio.h
  GEN      stdlib.h
  GEN      string.h
  GEN      strings.h
  GEN      sys/file.h
  GEN      sys/ioctl.h
  GEN      sys/select.h
  GEN      sys/socket.h
  GEN      sys/stat.h
  GEN      sys/time.h
  GEN      sys/types.h
  GEN      sys/uio.h
  GEN      sys/wait.h
  GEN      time.h
  GEN      unicase.h
  GEN      unictype.h
  GEN      uninorm.h
  GEN      unistd.h
  GEN      unistr.h
  GEN      unitypes.h
  GEN      uniwidth.h
  GEN      wchar.h
  GEN      wctype.h
make  all-recursive
make[3]: Entering directory '/home/sushma/rpmbuild/BUILD/wget-1.19.1/32bit/lib'
make[4]: Entering directory '/home/sushma/rpmbuild/BUILD/wget-1.19.1/32bit/lib'
  CC       base32.o
  CC       binary-io.o
  CC       c-ctype.o
  CC       c-strcasecmp.o
  CC       c-strncasecmp.o
  CC       c-strcasestr.o
  CC       cloexec.o
  CC       md2.o
  CC       md4.o
  CC       md5.o
  CC       sha1.o
  CC       sha256.o
  CC       sha512.o
  CC       dirname.o
  CC       basename.o
  CC       dirname-lgpl.o
  CC       basename-lgpl.o
  CC       stripslash.o
  CC       exitfail.o
  CC       fatal-signal.o
  CC       fd-hook.o
  CC       fd-safer-flag.o
  CC       dup-safer-flag.o
  CC       getprogname.o
  CC       gettime.o
  CC       hard-locale.o
  CC       localcharset.o
  CC       glthread/lock.o
  CC       mbchar.o
  CC       mbiter.o
  CC       pipe2.o
  CC       pipe2-safer.o
  CC       quotearg.o
  CC       sig-handler.o
  CC       sockets.o
  CC       spawn-pipe.o
  CC       stat-time.o
  CC       strnlen1.o
  CC       sys_socket.o
  CC       tempname.o
  CC       glthread/threadlib.o
  CC       timespec.o
  CC       tmpdir.o
  CC       u64.o
  CC       unicase/cased.o
  CC       unicase/empty-prefix-context.o
  CC       unicase/empty-suffix-context.o
  CC       unicase/ignorable.o
  CC       unicase/special-casing.o
  CC       unicase/tolower.o
  CC       unicase/u8-casemap.o
  CC       unicase/u8-tolower.o
  CC       unictype/combiningclass.o
  CC       unictype/pr_soft_dotted.o
  CC       uninorm/decompose-internal.o
  CC       uninorm/u8-normalize.o
  CC       unistd.o
  CC       dup-safer.o
  CC       fd-safer.o
  CC       pipe-safer.o
  CC       unistr/u8-cpy.o
  CC       unistr/u8-mbtouc-unsafe.o
  CC       unistr/u8-mbtouc-unsafe-aux.o
  CC       unistr/u8-strlen.o
  CC       unistr/u8-uctomb.o
  CC       unistr/u8-uctomb-aux.o
  CC       uniwidth/width.o
  CC       utimens.o
  CC       wait-process.o
  CC       wctype-h.o
  CC       xmalloc.o
  CC       xalloc-die.o
  CC       xsize.o
  CC       xstrndup.o
  CC       asnprintf.o
  CC       asprintf.o
  CC       error.o
  CC       fcntl.o
  CC       float.o
  CC       flock.o
  CC       fopen.o
  CC       futimens.o
  CC       gai_strerror.o
  CC       getdelim.o
  CC       getline.o
  CC       getopt.o
  CC       getopt1.o
  CC       getpass.o
  CC       link.o
  CC       lstat.o
  CC       mbrtowc.o
  CC       mbsinit.o
  CC       mbsrtowcs.o
  CC       mbsrtowcs-state.o
  CC       memrchr.o
  CC       mkostemp.o
  CC       mktime.o
  CC       open.o
  CC       printf-args.o
  CC       printf-parse.o
  CC       rawmemchr.o
  CC       regex.o
  CC       secure_getenv.o
  CC       stat.o
  CC       strchrnul.o
  CC       strerror.o
  CC       strerror_r.o
  CC       symlink.o
  CC       timegm.o
  CC       unlink.o
  CC       vasnprintf.o
  CC       vasprintf.o
  CC       wcrtomb.o
  CC       xmemdup0.o
  AR       libgnu.a
  GEN      charset.alias
  GEN      ref-add.sed
  GEN      ref-del.sed
make[4]: Leaving directory '/home/sushma/rpmbuild/BUILD/wget-1.19.1/32bit/lib'
make[3]: Leaving directory '/home/sushma/rpmbuild/BUILD/wget-1.19.1/32bit/lib'
make[2]: Leaving directory '/home/sushma/rpmbuild/BUILD/wget-1.19.1/32bit/lib'
Making all in src
make[2]: Entering directory '/home/sushma/rpmbuild/BUILD/wget-1.19.1/32bit/src'
make  all-am
make[3]: Entering directory '/home/sushma/rpmbuild/BUILD/wget-1.19.1/32bit/src'
  CC       connect.o
  CC       convert.o
  CC       cookies.o
  CC       ftp.o
  CC       css_.o
  CC       css-url.o
  CC       ftp-basic.o
  CC       ftp-ls.o
  CC       hash.o
  CC       host.o
  CC       hsts.o
  CC       html-parse.o
  CC       html-url.o
  CC       http.o
  CC       init.o
  CC       log.o
  CC       main.o
  CC       netrc.o
  CC       progress.o
  CC       ptimer.o
  CC       recur.o
  CC       res.o
  CC       retr.o
  CC       spider.o
  CC       url.o
  CC       warc.o
warc.c: In function 'warc_uuid_str':
warc.c:639:31: warning: passing argument 2 of 'uuid_to_string' from incompatible pointer type [-Wincompatible-pointer-types]
   uuid_to_string (&record_id, &uuid_str, NULL);
                               ^
In file included from warc.c:51:0:
/usr/include/uuid.h:109:13: note: expected 'unsigned char **' but argument is of type 'char **'
 extern void uuid_to_string(uuid_p_t uuid, unsigned char **uuid_string, unsigned32 *status);
             ^~~~~~~~~~~~~~
  CC       utils.o
  CC       exits.o
  CC       build_info.o
echo '/* version.c */' > version.c
echo '/* Autogenerated by Makefile - DO NOT EDIT */' >> version.c
echo '' >> version.c
echo '#include "version.h"' >> version.c
echo 'const char *version_string = "1.19.1";' >> version.c
echo 'const char *compilation_string = "'gcc -maix32 -D_LARGE_FILES -DHAVE_CONFIG_H -DSYSTEM_WGETRC=\"/opt/freeware/etc/wgetrc\" -DLOCALEDIR=\"/opt/freeware/share/locale\" -I.  -I../lib -I../lib -D_THREAD_SAFE -I/opt/freeware/include  -I/opt/freeware/include   -DNDEBUG '";' \
    | sed -e 's/[\\"]/\\&/g' -e 's/\\"/"/' -e 's/\\";$/";/' >> version.c
echo 'const char *link_string = "'gcc -maix32 -D_LARGE_FILES  -I/opt/freeware/include   -DNDEBUG  \
  /usr/lib/libssl.a /usr/lib/libcrypto.a -ldl -L/opt/freeware/lib -lz    ftp-opie.o openssl.o http-ntlm.o ../lib/libgnu.a           /opt/freeware/lib/libintl.a -liconv -lc -pthread   -liconv'";' \
    | sed -e 's/[\\"]/\\&/g' -e 's/\\"/"/' -e 's/\\";$/";/' >> version.c
  CC       version.o
  CC       ftp-opie.o
  CC       openssl.o
  CC       http-ntlm.o
  CCLD     wget
make[3]: Leaving directory '/home/sushma/rpmbuild/BUILD/wget-1.19.1/32bit/src'
make[2]: Leaving directory '/home/sushma/rpmbuild/BUILD/wget-1.19.1/32bit/src'
Making all in doc
make[2]: Entering directory '/home/sushma/rpmbuild/BUILD/wget-1.19.1/32bit/doc'
./texi2pod.pl -D VERSION="1.19.1" ./wget.texi wget.pod
/opt/freeware/bin/pod2man --center="GNU Wget" --release="GNU Wget 1.19.1" --utf8 wget.pod > wget.1 || \
/opt/freeware/bin/pod2man --center="GNU Wget" --release="GNU Wget 1.19.1" wget.pod > wget.1
make[2]: Leaving directory '/home/sushma/rpmbuild/BUILD/wget-1.19.1/32bit/doc'
Making all in po
make[2]: Entering directory '/home/sushma/rpmbuild/BUILD/wget-1.19.1/32bit/po'
make[2]: Nothing to be done for 'all'.
make[2]: Leaving directory '/home/sushma/rpmbuild/BUILD/wget-1.19.1/32bit/po'
Making all in tests
make[2]: Entering directory '/home/sushma/rpmbuild/BUILD/wget-1.19.1/32bit/tests'
make[2]: Nothing to be done for 'all'.
make[2]: Leaving directory '/home/sushma/rpmbuild/BUILD/wget-1.19.1/32bit/tests'
Making all in util
make[2]: Entering directory '/home/sushma/rpmbuild/BUILD/wget-1.19.1/32bit/util'
make[2]: Nothing to be done for 'all'.
make[2]: Leaving directory '/home/sushma/rpmbuild/BUILD/wget-1.19.1/32bit/util'
Making all in testenv
make[2]: Entering directory '/home/sushma/rpmbuild/BUILD/wget-1.19.1/32bit/testenv'
make[2]: Nothing to be done for 'all'.
make[2]: Leaving directory '/home/sushma/rpmbuild/BUILD/wget-1.19.1/32bit/testenv'
make[2]: Entering directory '/home/sushma/rpmbuild/BUILD/wget-1.19.1/32bit'
make[2]: Nothing to be done for 'all-am'.
make[2]: Leaving directory '/home/sushma/rpmbuild/BUILD/wget-1.19.1/32bit'
make[1]: Leaving directory '/home/sushma/rpmbuild/BUILD/wget-1.19.1/32bit'
+ [ 1 == 1 ]
+ gmake -k check
  GEN      public-submodule-commit
gmake  check-recursive
gmake[1]: Entering directory '/home/sushma/rpmbuild/BUILD/wget-1.19.1/32bit'
Making check in lib
gmake[2]: Entering directory '/home/sushma/rpmbuild/BUILD/wget-1.19.1/32bit/lib'
gmake  check-recursive
gmake[3]: Entering directory '/home/sushma/rpmbuild/BUILD/wget-1.19.1/32bit/lib'
gmake[4]: Entering directory '/home/sushma/rpmbuild/BUILD/wget-1.19.1/32bit/lib'
gmake[4]: Nothing to be done for 'check-am'.
gmake[4]: Leaving directory '/home/sushma/rpmbuild/BUILD/wget-1.19.1/32bit/lib'
gmake[3]: Leaving directory '/home/sushma/rpmbuild/BUILD/wget-1.19.1/32bit/lib'
gmake[2]: Leaving directory '/home/sushma/rpmbuild/BUILD/wget-1.19.1/32bit/lib'
Making check in src
gmake[2]: Entering directory '/home/sushma/rpmbuild/BUILD/wget-1.19.1/32bit/src'
gmake  libunittest.a
gmake[3]: Entering directory '/home/sushma/rpmbuild/BUILD/wget-1.19.1/32bit/src'
  CC       libunittest_a-connect.o
  CC       libunittest_a-convert.o
  CC       libunittest_a-cookies.o
  CC       libunittest_a-ftp.o
  CC       libunittest_a-css_.o
  CC       libunittest_a-css-url.o
  CC       libunittest_a-ftp-basic.o
  CC       libunittest_a-ftp-ls.o
  CC       libunittest_a-hash.o
  CC       libunittest_a-host.o
  CC       libunittest_a-hsts.o
  CC       libunittest_a-html-parse.o
  CC       libunittest_a-html-url.o
  CC       libunittest_a-http.o
  CC       libunittest_a-init.o
  CC       libunittest_a-log.o
  CC       libunittest_a-main.o
  CC       libunittest_a-netrc.o
  CC       libunittest_a-progress.o
  CC       libunittest_a-ptimer.o
  CC       libunittest_a-recur.o
  CC       libunittest_a-res.o
  CC       libunittest_a-retr.o
  CC       libunittest_a-spider.o
  CC       libunittest_a-url.o
  CC       libunittest_a-warc.o
warc.c: In function 'warc_uuid_str':
warc.c:639:31: warning: passing argument 2 of 'uuid_to_string' from incompatible pointer type [-Wincompatible-pointer-types]
   uuid_to_string (&record_id, &uuid_str, NULL);
                               ^
In file included from warc.c:51:0:
/usr/include/uuid.h:109:13: note: expected 'unsigned char **' but argument is of type 'char **'
 extern void uuid_to_string(uuid_p_t uuid, unsigned char **uuid_string, unsigned32 *status);
             ^~~~~~~~~~~~~~
  CC       libunittest_a-utils.o
  CC       libunittest_a-exits.o
  CC       libunittest_a-build_info.o
  CC       libunittest_a-test.o
  CC       libunittest_a-version.o
  AR       libunittest.a
gmake[3]: Leaving directory '/home/sushma/rpmbuild/BUILD/wget-1.19.1/32bit/src'
gmake[2]: Leaving directory '/home/sushma/rpmbuild/BUILD/wget-1.19.1/32bit/src'
Making check in doc
gmake[2]: Entering directory '/home/sushma/rpmbuild/BUILD/wget-1.19.1/32bit/doc'
gmake[2]: Nothing to be done for 'check'.
gmake[2]: Leaving directory '/home/sushma/rpmbuild/BUILD/wget-1.19.1/32bit/doc'
Making check in po
gmake[2]: Entering directory '/home/sushma/rpmbuild/BUILD/wget-1.19.1/32bit/po'
gmake[2]: Nothing to be done for 'check'.
gmake[2]: Leaving directory '/home/sushma/rpmbuild/BUILD/wget-1.19.1/32bit/po'
Making check in tests
gmake[2]: Entering directory '/home/sushma/rpmbuild/BUILD/wget-1.19.1/32bit/tests'
gmake  unit-tests
gmake[3]: Entering directory '/home/sushma/rpmbuild/BUILD/wget-1.19.1/32bit/tests'
cd ../src && gmake  libunittest.a
gmake[4]: Entering directory '/home/sushma/rpmbuild/BUILD/wget-1.19.1/32bit/src'
gmake[4]: Leaving directory '/home/sushma/rpmbuild/BUILD/wget-1.19.1/32bit/src'
  CCLD     unit-tests
gmake[3]: Leaving directory '/home/sushma/rpmbuild/BUILD/wget-1.19.1/32bit/tests'
gmake  check-TESTS
gmake[3]: Entering directory '/home/sushma/rpmbuild/BUILD/wget-1.19.1/32bit/tests'
gmake[4]: Entering directory '/home/sushma/rpmbuild/BUILD/wget-1.19.1/32bit/tests'
cd ../src && gmake  libunittest.a
gmake[5]: Entering directory '/home/sushma/rpmbuild/BUILD/wget-1.19.1/32bit/src'
gmake[5]: Leaving directory '/home/sushma/rpmbuild/BUILD/wget-1.19.1/32bit/src'
  CCLD     unit-tests
PASS: unit-tests
FAIL: Test-auth-basic.px
FAIL: Test-auth-no-challenge.px
FAIL: Test-auth-no-challenge-url.px
FAIL: Test-auth-with-content-disposition.px
FAIL: Test-auth-retcode.px
FAIL: Test-c-full.px
FAIL: Test-c-partial.px
FAIL: Test-c.px
FAIL: Test-c-shorter.px
FAIL: Test-cookies.px
FAIL: Test-cookies-401.px
FAIL: Test-E-k-K.px
FAIL: Test-E-k.px
PASS: Test-ftp.px
PASS: Test-ftp-pasv-fail.px
PASS: Test-ftp-bad-list.px
PASS: Test-ftp-recursive.px
SKIP: Test-ftp-iri.px
SKIP: Test-ftp-iri-fallback.px
SKIP: Test-ftp-iri-recursive.px
SKIP: Test-ftp-iri-disabled.px
PASS: Test-ftp-list-Multinet.px
PASS: Test-ftp-list-Unknown.px
PASS: Test-ftp-list-Unknown-a.px
PASS: Test-ftp-list-Unknown-hidden.px
PASS: Test-ftp-list-Unknown-list-a-fails.px
PASS: Test-ftp-list-UNIX-hidden.px
PASS: Test-ftp--start-pos.px
FAIL: Test-HTTP-Content-Disposition-1.px
FAIL: Test-HTTP-Content-Disposition-2.px
FAIL: Test-HTTP-Content-Disposition.px
PASS: Test-i-ftp.px
FAIL: Test-i-http.px
SKIP: Test-idn-headers.px
SKIP: Test-idn-meta.px
SKIP: Test-idn-cmd.px
SKIP: Test-idn-cmd-utf8.px
SKIP: Test-idn-robots.px
SKIP: Test-idn-robots-utf8.px
SKIP: Test-iri.px
SKIP: Test-iri-percent.px
FAIL: Test-iri-disabled.px
SKIP: Test-iri-forced-remote.px
SKIP: Test-iri-list.px
FAIL: Test-k.px
FAIL: Test-meta-robots.px
FAIL: Test-N-current.px
FAIL: Test-N-HTTP-Content-Disposition.px
FAIL: Test-N--no-content-disposition.px
FAIL: Test-N--no-content-disposition-trivial.px
FAIL: Test-N-no-info.px
FAIL: Test--no-content-disposition.px
FAIL: Test--no-content-disposition-trivial.px
FAIL: Test-N-old.px
FAIL: Test-nonexisting-quiet.px
FAIL: Test-noop.px
FAIL: Test-np.px
FAIL: Test-N.px
FAIL: Test-N-smaller.px
FAIL: Test-O-HTTP-Content-Disposition.px
FAIL: Test-O-nc.px
FAIL: Test-O--no-content-disposition.px
FAIL: Test-O--no-content-disposition-trivial.px
FAIL: Test-O-nonexisting.px
FAIL: Test-O.px
FAIL: Test--post-file.px
FAIL: Test-proxied-https-auth.px
FAIL: Test-proxied-https-auth-keepalive.px
FAIL: Test-proxy-auth-basic.px
FAIL: Test-restrict-ascii.px
FAIL: Test-Restrict-Lowercase.px
FAIL: Test-Restrict-Uppercase.px
FAIL: Test-stdouterr.px
FAIL: Test--spider-fail.px
FAIL: Test--spider.px
FAIL: Test--spider-r-HTTP-Content-Disposition.px
FAIL: Test--spider-r--no-content-disposition.px
FAIL: Test--spider-r--no-content-disposition-trivial.px
FAIL: Test--spider-r.px
FAIL: Test--start-pos.px
FAIL: Test--start-pos--continue.px
FAIL: Test--httpsonly-r.px
FAIL: Test-204.px
PASS: Test-ftp-pasv-not-supported.px
============================================================================
Testsuite summary for wget 1.19.1
============================================================================
# TOTAL: 85
# PASS:  14
# SKIP:  14
# XFAIL: 0
# FAIL:  57
# XPASS: 0
# ERROR: 0
============================================================================
See tests/test-suite.log
Please report to bug-wget@gnu.org
============================================================================
Makefile:1702: recipe for target 'test-suite.log' failed
gmake[4]: *** [test-suite.log] Error 1
gmake[4]: Leaving directory '/home/sushma/rpmbuild/BUILD/wget-1.19.1/32bit/tests'
Makefile:1808: recipe for target 'check-TESTS' failed
gmake[3]: *** [check-TESTS] Error 2
gmake[3]: Leaving directory '/home/sushma/rpmbuild/BUILD/wget-1.19.1/32bit/tests'
Makefile:1881: recipe for target 'check-am' failed
gmake[2]: *** [check-am] Error 2
gmake[2]: Target 'check' not remade because of errors.
gmake[2]: Leaving directory '/home/sushma/rpmbuild/BUILD/wget-1.19.1/32bit/tests'
Making check in util
gmake[2]: Entering directory '/home/sushma/rpmbuild/BUILD/wget-1.19.1/32bit/util'
gmake[2]: Nothing to be done for 'check'.
gmake[2]: Leaving directory '/home/sushma/rpmbuild/BUILD/wget-1.19.1/32bit/util'
Making check in testenv
gmake[2]: Entering directory '/home/sushma/rpmbuild/BUILD/wget-1.19.1/32bit/testenv'
gmake  check-TESTS
gmake[3]: Entering directory '/home/sushma/rpmbuild/BUILD/wget-1.19.1/32bit/testenv'
gmake[4]: Entering directory '/home/sushma/rpmbuild/BUILD/wget-1.19.1/32bit/testenv'
============================================================================
Testsuite summary for wget 1.19.1
============================================================================
# TOTAL: 0
# PASS:  0
# SKIP:  0
# XFAIL: 0
# FAIL:  0
# XPASS: 0
# ERROR: 0
============================================================================
gmake[4]: Leaving directory '/home/sushma/rpmbuild/BUILD/wget-1.19.1/32bit/testenv'
gmake[3]: Leaving directory '/home/sushma/rpmbuild/BUILD/wget-1.19.1/32bit/testenv'
gmake[2]: Leaving directory '/home/sushma/rpmbuild/BUILD/wget-1.19.1/32bit/testenv'
gmake[2]: Entering directory '/home/sushma/rpmbuild/BUILD/wget-1.19.1/32bit'
gmake[2]: Nothing to be done for 'check-am'.
gmake[2]: Leaving directory '/home/sushma/rpmbuild/BUILD/wget-1.19.1/32bit'
Makefile:1454: recipe for target 'check-recursive' failed
gmake[1]: *** [check-recursive] Error 1
gmake[1]: Leaving directory '/home/sushma/rpmbuild/BUILD/wget-1.19.1/32bit'
Makefile:1746: recipe for target 'check' failed
gmake: *** [check] Error 2
+ true
+ exit 0
Executing(%install): /bin/sh -e /var/opt/freeware/tmp/rpm-tmp.11204
+ umask 022
+ cd /home/sushma/rpmbuild/BUILD
+ cd wget-1.19.1
+ [ /var/tmp/wget-1.19.1-1-root != / ]
+ rm -rf /var/tmp/wget-1.19.1-1-root
+ cd 64bit
+ export AR=/usr/bin/ar -X64
+ export OBJECT_MODE=64
+ make DESTDIR=/var/tmp/wget-1.19.1-1-root install
WARNING: unable to verify if 1.19.1 is the correct version
make  install-recursive
make[1]: Entering directory '/home/sushma/rpmbuild/BUILD/wget-1.19.1/64bit'
Making install in lib
make[2]: Entering directory '/home/sushma/rpmbuild/BUILD/wget-1.19.1/64bit/lib'
make  install-recursive
make[3]: Entering directory '/home/sushma/rpmbuild/BUILD/wget-1.19.1/64bit/lib'
make[4]: Entering directory '/home/sushma/rpmbuild/BUILD/wget-1.19.1/64bit/lib'
make[5]: Entering directory '/home/sushma/rpmbuild/BUILD/wget-1.19.1/64bit/lib'
if test no = no; then \
  case 'aix6.1.9.0' in \
    darwin[56]*) \
      need_charset_alias=true ;; \
    darwin* | cygwin* | mingw* | pw32* | cegcc*) \
      need_charset_alias=false ;; \
    *) \
      need_charset_alias=true ;; \
  esac ; \
else \
  need_charset_alias=false ; \
fi ; \
if $need_charset_alias; then \
  /bin/sh /home/sushma/rpmbuild/BUILD/wget-1.19.1/64bit/build-aux/install-sh -d /var/tmp/wget-1.19.1-1-root/opt/freeware/lib ; \
fi ; \
if test -f /var/tmp/wget-1.19.1-1-root/opt/freeware/lib/charset.alias; then \
  sed -f ref-add.sed /var/tmp/wget-1.19.1-1-root/opt/freeware/lib/charset.alias > /var/tmp/wget-1.19.1-1-root/opt/freeware/lib/charset.tmp ; \
  /opt/freeware/bin/install -c -m 644 /var/tmp/wget-1.19.1-1-root/opt/freeware/lib/charset.tmp /var/tmp/wget-1.19.1-1-root/opt/freeware/lib/charset.alias ; \
  rm -f /var/tmp/wget-1.19.1-1-root/opt/freeware/lib/charset.tmp ; \
else \
  if $need_charset_alias; then \
    sed -f ref-add.sed charset.alias > /var/tmp/wget-1.19.1-1-root/opt/freeware/lib/charset.tmp ; \
    /opt/freeware/bin/install -c -m 644 /var/tmp/wget-1.19.1-1-root/opt/freeware/lib/charset.tmp /var/tmp/wget-1.19.1-1-root/opt/freeware/lib/charset.alias ; \
    rm -f /var/tmp/wget-1.19.1-1-root/opt/freeware/lib/charset.tmp ; \
  fi ; \
fi
make[5]: Nothing to be done for 'install-data-am'.
make[5]: Leaving directory '/home/sushma/rpmbuild/BUILD/wget-1.19.1/64bit/lib'
make[4]: Leaving directory '/home/sushma/rpmbuild/BUILD/wget-1.19.1/64bit/lib'
make[3]: Leaving directory '/home/sushma/rpmbuild/BUILD/wget-1.19.1/64bit/lib'
make[2]: Leaving directory '/home/sushma/rpmbuild/BUILD/wget-1.19.1/64bit/lib'
Making install in src
make[2]: Entering directory '/home/sushma/rpmbuild/BUILD/wget-1.19.1/64bit/src'
make[3]: Entering directory '/home/sushma/rpmbuild/BUILD/wget-1.19.1/64bit/src'
 /opt/freeware/bin/mkdir -p '/var/tmp/wget-1.19.1-1-root/opt/freeware/bin'
  /opt/freeware/bin/install -c wget '/var/tmp/wget-1.19.1-1-root/opt/freeware/bin'
make[3]: Nothing to be done for 'install-data-am'.
make[3]: Leaving directory '/home/sushma/rpmbuild/BUILD/wget-1.19.1/64bit/src'
make[2]: Leaving directory '/home/sushma/rpmbuild/BUILD/wget-1.19.1/64bit/src'
Making install in doc
make[2]: Entering directory '/home/sushma/rpmbuild/BUILD/wget-1.19.1/64bit/doc'
make[3]: Entering directory '/home/sushma/rpmbuild/BUILD/wget-1.19.1/64bit/doc'
make[3]: Nothing to be done for 'install-exec-am'.
/bin/sh /home/sushma/rpmbuild/BUILD/wget-1.19.1/64bit/build-aux/install-sh -d /var/tmp/wget-1.19.1-1-root/opt/freeware/etc
/bin/sh /home/sushma/rpmbuild/BUILD/wget-1.19.1/64bit/build-aux/install-sh -d /var/tmp/wget-1.19.1-1-root/opt/freeware/man/man1
/opt/freeware/bin/install -c -m 644 wget.1 /var/tmp/wget-1.19.1-1-root/opt/freeware/man/man1/wget.1
 /opt/freeware/bin/mkdir -p '/var/tmp/wget-1.19.1-1-root/opt/freeware/info'
 /opt/freeware/bin/install -c -m 644 ./wget.info '/var/tmp/wget-1.19.1-1-root/opt/freeware/info'
 install-info --info-dir='/var/tmp/wget-1.19.1-1-root/opt/freeware/info' '/var/tmp/wget-1.19.1-1-root/opt/freeware/info/wget.info'
make[3]: Leaving directory '/home/sushma/rpmbuild/BUILD/wget-1.19.1/64bit/doc'
make[2]: Leaving directory '/home/sushma/rpmbuild/BUILD/wget-1.19.1/64bit/doc'
Making install in po
make[2]: Entering directory '/home/sushma/rpmbuild/BUILD/wget-1.19.1/64bit/po'
installing be.gmo as /var/tmp/wget-1.19.1-1-root/opt/freeware/share/locale/be/LC_MESSAGES/wget.mo
installing bg.gmo as /var/tmp/wget-1.19.1-1-root/opt/freeware/share/locale/bg/LC_MESSAGES/wget.mo
installing ca.gmo as /var/tmp/wget-1.19.1-1-root/opt/freeware/share/locale/ca/LC_MESSAGES/wget.mo
installing cs.gmo as /var/tmp/wget-1.19.1-1-root/opt/freeware/share/locale/cs/LC_MESSAGES/wget.mo
installing da.gmo as /var/tmp/wget-1.19.1-1-root/opt/freeware/share/locale/da/LC_MESSAGES/wget.mo
installing de.gmo as /var/tmp/wget-1.19.1-1-root/opt/freeware/share/locale/de/LC_MESSAGES/wget.mo
installing el.gmo as /var/tmp/wget-1.19.1-1-root/opt/freeware/share/locale/el/LC_MESSAGES/wget.mo
installing en_GB.gmo as /var/tmp/wget-1.19.1-1-root/opt/freeware/share/locale/en_GB/LC_MESSAGES/wget.mo
installing eo.gmo as /var/tmp/wget-1.19.1-1-root/opt/freeware/share/locale/eo/LC_MESSAGES/wget.mo
installing es.gmo as /var/tmp/wget-1.19.1-1-root/opt/freeware/share/locale/es/LC_MESSAGES/wget.mo
installing et.gmo as /var/tmp/wget-1.19.1-1-root/opt/freeware/share/locale/et/LC_MESSAGES/wget.mo
installing eu.gmo as /var/tmp/wget-1.19.1-1-root/opt/freeware/share/locale/eu/LC_MESSAGES/wget.mo
installing fi.gmo as /var/tmp/wget-1.19.1-1-root/opt/freeware/share/locale/fi/LC_MESSAGES/wget.mo
installing fr.gmo as /var/tmp/wget-1.19.1-1-root/opt/freeware/share/locale/fr/LC_MESSAGES/wget.mo
installing ga.gmo as /var/tmp/wget-1.19.1-1-root/opt/freeware/share/locale/ga/LC_MESSAGES/wget.mo
installing gl.gmo as /var/tmp/wget-1.19.1-1-root/opt/freeware/share/locale/gl/LC_MESSAGES/wget.mo
installing he.gmo as /var/tmp/wget-1.19.1-1-root/opt/freeware/share/locale/he/LC_MESSAGES/wget.mo
installing hr.gmo as /var/tmp/wget-1.19.1-1-root/opt/freeware/share/locale/hr/LC_MESSAGES/wget.mo
installing hu.gmo as /var/tmp/wget-1.19.1-1-root/opt/freeware/share/locale/hu/LC_MESSAGES/wget.mo
installing id.gmo as /var/tmp/wget-1.19.1-1-root/opt/freeware/share/locale/id/LC_MESSAGES/wget.mo
installing it.gmo as /var/tmp/wget-1.19.1-1-root/opt/freeware/share/locale/it/LC_MESSAGES/wget.mo
installing ja.gmo as /var/tmp/wget-1.19.1-1-root/opt/freeware/share/locale/ja/LC_MESSAGES/wget.mo
installing lt.gmo as /var/tmp/wget-1.19.1-1-root/opt/freeware/share/locale/lt/LC_MESSAGES/wget.mo
installing nb.gmo as /var/tmp/wget-1.19.1-1-root/opt/freeware/share/locale/nb/LC_MESSAGES/wget.mo
installing nl.gmo as /var/tmp/wget-1.19.1-1-root/opt/freeware/share/locale/nl/LC_MESSAGES/wget.mo
installing pl.gmo as /var/tmp/wget-1.19.1-1-root/opt/freeware/share/locale/pl/LC_MESSAGES/wget.mo
installing pt.gmo as /var/tmp/wget-1.19.1-1-root/opt/freeware/share/locale/pt/LC_MESSAGES/wget.mo
installing pt_BR.gmo as /var/tmp/wget-1.19.1-1-root/opt/freeware/share/locale/pt_BR/LC_MESSAGES/wget.mo
installing ro.gmo as /var/tmp/wget-1.19.1-1-root/opt/freeware/share/locale/ro/LC_MESSAGES/wget.mo
installing ru.gmo as /var/tmp/wget-1.19.1-1-root/opt/freeware/share/locale/ru/LC_MESSAGES/wget.mo
installing sk.gmo as /var/tmp/wget-1.19.1-1-root/opt/freeware/share/locale/sk/LC_MESSAGES/wget.mo
installing sl.gmo as /var/tmp/wget-1.19.1-1-root/opt/freeware/share/locale/sl/LC_MESSAGES/wget.mo
installing sr.gmo as /var/tmp/wget-1.19.1-1-root/opt/freeware/share/locale/sr/LC_MESSAGES/wget.mo
installing sv.gmo as /var/tmp/wget-1.19.1-1-root/opt/freeware/share/locale/sv/LC_MESSAGES/wget.mo
installing tr.gmo as /var/tmp/wget-1.19.1-1-root/opt/freeware/share/locale/tr/LC_MESSAGES/wget.mo
installing uk.gmo as /var/tmp/wget-1.19.1-1-root/opt/freeware/share/locale/uk/LC_MESSAGES/wget.mo
installing vi.gmo as /var/tmp/wget-1.19.1-1-root/opt/freeware/share/locale/vi/LC_MESSAGES/wget.mo
installing zh_CN.gmo as /var/tmp/wget-1.19.1-1-root/opt/freeware/share/locale/zh_CN/LC_MESSAGES/wget.mo
installing zh_TW.gmo as /var/tmp/wget-1.19.1-1-root/opt/freeware/share/locale/zh_TW/LC_MESSAGES/wget.mo
if test "wget" = "gettext-tools"; then \
  /opt/freeware/bin/mkdir -p /var/tmp/wget-1.19.1-1-root/opt/freeware/share/gettext/po; \
  for file in Makefile.in.in remove-potcdate.sin quot.sed boldquot.sed en@quot.header en@boldquot.header insert-header.sin Rules-quot   Makevars.template; do \
    /opt/freeware/bin/install -c -m 644 ./$file \
		    /var/tmp/wget-1.19.1-1-root/opt/freeware/share/gettext/po/$file; \
  done; \
  for file in Makevars; do \
    rm -f /var/tmp/wget-1.19.1-1-root/opt/freeware/share/gettext/po/$file; \
  done; \
else \
  : ; \
fi
make[2]: Leaving directory '/home/sushma/rpmbuild/BUILD/wget-1.19.1/64bit/po'
Making install in tests
make[2]: Entering directory '/home/sushma/rpmbuild/BUILD/wget-1.19.1/64bit/tests'
make[3]: Entering directory '/home/sushma/rpmbuild/BUILD/wget-1.19.1/64bit/tests'
make[3]: Nothing to be done for 'install-exec-am'.
make[3]: Nothing to be done for 'install-data-am'.
make[3]: Leaving directory '/home/sushma/rpmbuild/BUILD/wget-1.19.1/64bit/tests'
make[2]: Leaving directory '/home/sushma/rpmbuild/BUILD/wget-1.19.1/64bit/tests'
Making install in util
make[2]: Entering directory '/home/sushma/rpmbuild/BUILD/wget-1.19.1/64bit/util'
make[3]: Entering directory '/home/sushma/rpmbuild/BUILD/wget-1.19.1/64bit/util'
make[3]: Nothing to be done for 'install-exec-am'.
make[3]: Nothing to be done for 'install-data-am'.
make[3]: Leaving directory '/home/sushma/rpmbuild/BUILD/wget-1.19.1/64bit/util'
make[2]: Leaving directory '/home/sushma/rpmbuild/BUILD/wget-1.19.1/64bit/util'
Making install in testenv
make[2]: Entering directory '/home/sushma/rpmbuild/BUILD/wget-1.19.1/64bit/testenv'
make[3]: Entering directory '/home/sushma/rpmbuild/BUILD/wget-1.19.1/64bit/testenv'
make[3]: Nothing to be done for 'install-exec-am'.
make[3]: Nothing to be done for 'install-data-am'.
make[3]: Leaving directory '/home/sushma/rpmbuild/BUILD/wget-1.19.1/64bit/testenv'
make[2]: Leaving directory '/home/sushma/rpmbuild/BUILD/wget-1.19.1/64bit/testenv'
make[2]: Entering directory '/home/sushma/rpmbuild/BUILD/wget-1.19.1/64bit'
make[3]: Entering directory '/home/sushma/rpmbuild/BUILD/wget-1.19.1/64bit'
make[3]: Nothing to be done for 'install-exec-am'.
make[3]: Nothing to be done for 'install-data-am'.
make[3]: Leaving directory '/home/sushma/rpmbuild/BUILD/wget-1.19.1/64bit'
make[2]: Leaving directory '/home/sushma/rpmbuild/BUILD/wget-1.19.1/64bit'
make[1]: Leaving directory '/home/sushma/rpmbuild/BUILD/wget-1.19.1/64bit'
+ /usr/bin/strip /var/tmp/wget-1.19.1-1-root/opt/freeware/bin/wget
+ cd /var/tmp/wget-1.19.1-1-root/opt/freeware/bin
+ mv wget wget_64
+ cd ../32bit
+ export AR=/usr/bin/ar -X32
+ export OBJECT_MODE=32
+ make DESTDIR=/var/tmp/wget-1.19.1-1-root install
WARNING: unable to verify if 1.19.1 is the correct version
make  install-recursive
make[1]: Entering directory '/home/sushma/rpmbuild/BUILD/wget-1.19.1/32bit'
Making install in lib
make[2]: Entering directory '/home/sushma/rpmbuild/BUILD/wget-1.19.1/32bit/lib'
make  install-recursive
make[3]: Entering directory '/home/sushma/rpmbuild/BUILD/wget-1.19.1/32bit/lib'
make[4]: Entering directory '/home/sushma/rpmbuild/BUILD/wget-1.19.1/32bit/lib'
make[5]: Entering directory '/home/sushma/rpmbuild/BUILD/wget-1.19.1/32bit/lib'
if test no = no; then \
  case 'aix6.1.9.0' in \
    darwin[56]*) \
      need_charset_alias=true ;; \
    darwin* | cygwin* | mingw* | pw32* | cegcc*) \
      need_charset_alias=false ;; \
    *) \
      need_charset_alias=true ;; \
  esac ; \
else \
  need_charset_alias=false ; \
fi ; \
if $need_charset_alias; then \
  /bin/sh /home/sushma/rpmbuild/BUILD/wget-1.19.1/32bit/build-aux/install-sh -d /var/tmp/wget-1.19.1-1-root/opt/freeware/lib ; \
fi ; \
if test -f /var/tmp/wget-1.19.1-1-root/opt/freeware/lib/charset.alias; then \
  sed -f ref-add.sed /var/tmp/wget-1.19.1-1-root/opt/freeware/lib/charset.alias > /var/tmp/wget-1.19.1-1-root/opt/freeware/lib/charset.tmp ; \
  /opt/freeware/bin/install -c -m 644 /var/tmp/wget-1.19.1-1-root/opt/freeware/lib/charset.tmp /var/tmp/wget-1.19.1-1-root/opt/freeware/lib/charset.alias ; \
  rm -f /var/tmp/wget-1.19.1-1-root/opt/freeware/lib/charset.tmp ; \
else \
  if $need_charset_alias; then \
    sed -f ref-add.sed charset.alias > /var/tmp/wget-1.19.1-1-root/opt/freeware/lib/charset.tmp ; \
    /opt/freeware/bin/install -c -m 644 /var/tmp/wget-1.19.1-1-root/opt/freeware/lib/charset.tmp /var/tmp/wget-1.19.1-1-root/opt/freeware/lib/charset.alias ; \
    rm -f /var/tmp/wget-1.19.1-1-root/opt/freeware/lib/charset.tmp ; \
  fi ; \
fi
make[5]: Nothing to be done for 'install-data-am'.
make[5]: Leaving directory '/home/sushma/rpmbuild/BUILD/wget-1.19.1/32bit/lib'
make[4]: Leaving directory '/home/sushma/rpmbuild/BUILD/wget-1.19.1/32bit/lib'
make[3]: Leaving directory '/home/sushma/rpmbuild/BUILD/wget-1.19.1/32bit/lib'
make[2]: Leaving directory '/home/sushma/rpmbuild/BUILD/wget-1.19.1/32bit/lib'
Making install in src
make[2]: Entering directory '/home/sushma/rpmbuild/BUILD/wget-1.19.1/32bit/src'
make[3]: Entering directory '/home/sushma/rpmbuild/BUILD/wget-1.19.1/32bit/src'
 /opt/freeware/bin/mkdir -p '/var/tmp/wget-1.19.1-1-root/opt/freeware/bin'
  /opt/freeware/bin/install -c wget '/var/tmp/wget-1.19.1-1-root/opt/freeware/bin'
make[3]: Nothing to be done for 'install-data-am'.
make[3]: Leaving directory '/home/sushma/rpmbuild/BUILD/wget-1.19.1/32bit/src'
make[2]: Leaving directory '/home/sushma/rpmbuild/BUILD/wget-1.19.1/32bit/src'
Making install in doc
make[2]: Entering directory '/home/sushma/rpmbuild/BUILD/wget-1.19.1/32bit/doc'
make[3]: Entering directory '/home/sushma/rpmbuild/BUILD/wget-1.19.1/32bit/doc'
make[3]: Nothing to be done for 'install-exec-am'.
/bin/sh /home/sushma/rpmbuild/BUILD/wget-1.19.1/32bit/build-aux/install-sh -d /var/tmp/wget-1.19.1-1-root/opt/freeware/etc

/bin/sh /home/sushma/rpmbuild/BUILD/wget-1.19.1/32bit/build-aux/install-sh -d /var/tmp/wget-1.19.1-1-root/opt/freeware/man/man1
/opt/freeware/bin/install -c -m 644 wget.1 /var/tmp/wget-1.19.1-1-root/opt/freeware/man/man1/wget.1
 /opt/freeware/bin/mkdir -p '/var/tmp/wget-1.19.1-1-root/opt/freeware/info'
 /opt/freeware/bin/install -c -m 644 ./wget.info '/var/tmp/wget-1.19.1-1-root/opt/freeware/info'
 install-info --info-dir='/var/tmp/wget-1.19.1-1-root/opt/freeware/info' '/var/tmp/wget-1.19.1-1-root/opt/freeware/info/wget.info'
make[3]: Leaving directory '/home/sushma/rpmbuild/BUILD/wget-1.19.1/32bit/doc'
make[2]: Leaving directory '/home/sushma/rpmbuild/BUILD/wget-1.19.1/32bit/doc'
Making install in po
make[2]: Entering directory '/home/sushma/rpmbuild/BUILD/wget-1.19.1/32bit/po'
installing be.gmo as /var/tmp/wget-1.19.1-1-root/opt/freeware/share/locale/be/LC_MESSAGES/wget.mo
installing bg.gmo as /var/tmp/wget-1.19.1-1-root/opt/freeware/share/locale/bg/LC_MESSAGES/wget.mo
installing ca.gmo as /var/tmp/wget-1.19.1-1-root/opt/freeware/share/locale/ca/LC_MESSAGES/wget.mo
installing cs.gmo as /var/tmp/wget-1.19.1-1-root/opt/freeware/share/locale/cs/LC_MESSAGES/wget.mo
installing da.gmo as /var/tmp/wget-1.19.1-1-root/opt/freeware/share/locale/da/LC_MESSAGES/wget.mo
installing de.gmo as /var/tmp/wget-1.19.1-1-root/opt/freeware/share/locale/de/LC_MESSAGES/wget.mo
installing el.gmo as /var/tmp/wget-1.19.1-1-root/opt/freeware/share/locale/el/LC_MESSAGES/wget.mo
installing en_GB.gmo as /var/tmp/wget-1.19.1-1-root/opt/freeware/share/locale/en_GB/LC_MESSAGES/wget.mo
installing eo.gmo as /var/tmp/wget-1.19.1-1-root/opt/freeware/share/locale/eo/LC_MESSAGES/wget.mo
installing es.gmo as /var/tmp/wget-1.19.1-1-root/opt/freeware/share/locale/es/LC_MESSAGES/wget.mo
installing et.gmo as /var/tmp/wget-1.19.1-1-root/opt/freeware/share/locale/et/LC_MESSAGES/wget.mo
installing eu.gmo as /var/tmp/wget-1.19.1-1-root/opt/freeware/share/locale/eu/LC_MESSAGES/wget.mo
installing fi.gmo as /var/tmp/wget-1.19.1-1-root/opt/freeware/share/locale/fi/LC_MESSAGES/wget.mo
installing fr.gmo as /var/tmp/wget-1.19.1-1-root/opt/freeware/share/locale/fr/LC_MESSAGES/wget.mo
installing ga.gmo as /var/tmp/wget-1.19.1-1-root/opt/freeware/share/locale/ga/LC_MESSAGES/wget.mo
installing gl.gmo as /var/tmp/wget-1.19.1-1-root/opt/freeware/share/locale/gl/LC_MESSAGES/wget.mo
installing he.gmo as /var/tmp/wget-1.19.1-1-root/opt/freeware/share/locale/he/LC_MESSAGES/wget.mo
installing hr.gmo as /var/tmp/wget-1.19.1-1-root/opt/freeware/share/locale/hr/LC_MESSAGES/wget.mo
installing hu.gmo as /var/tmp/wget-1.19.1-1-root/opt/freeware/share/locale/hu/LC_MESSAGES/wget.mo
installing id.gmo as /var/tmp/wget-1.19.1-1-root/opt/freeware/share/locale/id/LC_MESSAGES/wget.mo
installing it.gmo as /var/tmp/wget-1.19.1-1-root/opt/freeware/share/locale/it/LC_MESSAGES/wget.mo
installing ja.gmo as /var/tmp/wget-1.19.1-1-root/opt/freeware/share/locale/ja/LC_MESSAGES/wget.mo
installing lt.gmo as /var/tmp/wget-1.19.1-1-root/opt/freeware/share/locale/lt/LC_MESSAGES/wget.mo
installing nb.gmo as /var/tmp/wget-1.19.1-1-root/opt/freeware/share/locale/nb/LC_MESSAGES/wget.mo
installing nl.gmo as /var/tmp/wget-1.19.1-1-root/opt/freeware/share/locale/nl/LC_MESSAGES/wget.mo
installing pl.gmo as /var/tmp/wget-1.19.1-1-root/opt/freeware/share/locale/pl/LC_MESSAGES/wget.mo
installing pt.gmo as /var/tmp/wget-1.19.1-1-root/opt/freeware/share/locale/pt/LC_MESSAGES/wget.mo
installing pt_BR.gmo as /var/tmp/wget-1.19.1-1-root/opt/freeware/share/locale/pt_BR/LC_MESSAGES/wget.mo
installing ro.gmo as /var/tmp/wget-1.19.1-1-root/opt/freeware/share/locale/ro/LC_MESSAGES/wget.mo
installing ru.gmo as /var/tmp/wget-1.19.1-1-root/opt/freeware/share/locale/ru/LC_MESSAGES/wget.mo
installing sk.gmo as /var/tmp/wget-1.19.1-1-root/opt/freeware/share/locale/sk/LC_MESSAGES/wget.mo
installing sl.gmo as /var/tmp/wget-1.19.1-1-root/opt/freeware/share/locale/sl/LC_MESSAGES/wget.mo
installing sr.gmo as /var/tmp/wget-1.19.1-1-root/opt/freeware/share/locale/sr/LC_MESSAGES/wget.mo
installing sv.gmo as /var/tmp/wget-1.19.1-1-root/opt/freeware/share/locale/sv/LC_MESSAGES/wget.mo
installing tr.gmo as /var/tmp/wget-1.19.1-1-root/opt/freeware/share/locale/tr/LC_MESSAGES/wget.mo
installing uk.gmo as /var/tmp/wget-1.19.1-1-root/opt/freeware/share/locale/uk/LC_MESSAGES/wget.mo
installing vi.gmo as /var/tmp/wget-1.19.1-1-root/opt/freeware/share/locale/vi/LC_MESSAGES/wget.mo
installing zh_CN.gmo as /var/tmp/wget-1.19.1-1-root/opt/freeware/share/locale/zh_CN/LC_MESSAGES/wget.mo
installing zh_TW.gmo as /var/tmp/wget-1.19.1-1-root/opt/freeware/share/locale/zh_TW/LC_MESSAGES/wget.mo
if test "wget" = "gettext-tools"; then \
  /opt/freeware/bin/mkdir -p /var/tmp/wget-1.19.1-1-root/opt/freeware/share/gettext/po; \
  for file in Makefile.in.in remove-potcdate.sin quot.sed boldquot.sed en@quot.header en@boldquot.header insert-header.sin Rules-quot   Makevars.template; do \
    /opt/freeware/bin/install -c -m 644 ./$file \
		    /var/tmp/wget-1.19.1-1-root/opt/freeware/share/gettext/po/$file; \
  done; \
  for file in Makevars; do \
    rm -f /var/tmp/wget-1.19.1-1-root/opt/freeware/share/gettext/po/$file; \
  done; \
else \
  : ; \
fi
make[2]: Leaving directory '/home/sushma/rpmbuild/BUILD/wget-1.19.1/32bit/po'
Making install in tests
make[2]: Entering directory '/home/sushma/rpmbuild/BUILD/wget-1.19.1/32bit/tests'
make[3]: Entering directory '/home/sushma/rpmbuild/BUILD/wget-1.19.1/32bit/tests'
make[3]: Nothing to be done for 'install-exec-am'.
make[3]: Nothing to be done for 'install-data-am'.
make[3]: Leaving directory '/home/sushma/rpmbuild/BUILD/wget-1.19.1/32bit/tests'
make[2]: Leaving directory '/home/sushma/rpmbuild/BUILD/wget-1.19.1/32bit/tests'
Making install in util
make[2]: Entering directory '/home/sushma/rpmbuild/BUILD/wget-1.19.1/32bit/util'
make[3]: Entering directory '/home/sushma/rpmbuild/BUILD/wget-1.19.1/32bit/util'
make[3]: Nothing to be done for 'install-exec-am'.
make[3]: Nothing to be done for 'install-data-am'.
make[3]: Leaving directory '/home/sushma/rpmbuild/BUILD/wget-1.19.1/32bit/util'
make[2]: Leaving directory '/home/sushma/rpmbuild/BUILD/wget-1.19.1/32bit/util'
Making install in testenv
make[2]: Entering directory '/home/sushma/rpmbuild/BUILD/wget-1.19.1/32bit/testenv'
make[3]: Entering directory '/home/sushma/rpmbuild/BUILD/wget-1.19.1/32bit/testenv'
make[3]: Nothing to be done for 'install-exec-am'.
make[3]: Nothing to be done for 'install-data-am'.
make[3]: Leaving directory '/home/sushma/rpmbuild/BUILD/wget-1.19.1/32bit/testenv'
make[2]: Leaving directory '/home/sushma/rpmbuild/BUILD/wget-1.19.1/32bit/testenv'
make[2]: Entering directory '/home/sushma/rpmbuild/BUILD/wget-1.19.1/32bit'
make[3]: Entering directory '/home/sushma/rpmbuild/BUILD/wget-1.19.1/32bit'
make[3]: Nothing to be done for 'install-exec-am'.
make[3]: Nothing to be done for 'install-data-am'.
make[3]: Leaving directory '/home/sushma/rpmbuild/BUILD/wget-1.19.1/32bit'
make[2]: Leaving directory '/home/sushma/rpmbuild/BUILD/wget-1.19.1/32bit'
make[1]: Leaving directory '/home/sushma/rpmbuild/BUILD/wget-1.19.1/32bit'
+ /usr/bin/strip /var/tmp/wget-1.19.1-1-root/opt/freeware/bin/wget /var/tmp/wget-1.19.1-1-root/opt/freeware/bin/wget_64
strip: /var/tmp/wget-1.19.1-1-root/opt/freeware/bin/wget_64 -- 0654-423 /var/tmp/wget-1.19.1-1-root/opt/freeware/bin/wget_64 is not valid in the current object file mode.
	Use the -X option to specify the desired object mode.
+ :
+ cd /var/tmp/wget-1.19.1-1-root/opt/freeware/bin
+ mv wget wget_32
+ cd /var/tmp/wget-1.19.1-1-root/opt/freeware/bin
+ ln -sf wget_64 wget
+ rm -f /var/tmp/wget-1.19.1-1-root/opt/freeware/info/dir
+ gzip --best /var/tmp/wget-1.19.1-1-root/opt/freeware/info/wget.info
+ cd /var/tmp/wget-1.19.1-1-root
+ mkdir -p usr/bin
+ cd usr/bin
+ ln -sf ../../opt/freeware/bin/wget ../../opt/freeware/bin/wget_32 ../../opt/freeware/bin/wget_64 .
+ exit 0
Processing files: wget-1.19.1-1
Executing(%doc): /bin/sh -e /var/opt/freeware/tmp/rpm-tmp.29860
+ umask 022
+ cd /home/sushma/rpmbuild/BUILD
+ cd wget-1.19.1
+ DOCDIR=/var/tmp/wget-1.19.1-1-root/opt/freeware/doc/wget-1.19.1
+ export DOCDIR
+ rm -rf /var/tmp/wget-1.19.1-1-root/opt/freeware/doc/wget-1.19.1
+ /usr/bin/mkdir -p /var/tmp/wget-1.19.1-1-root/opt/freeware/doc/wget-1.19.1
+ cp -pr 32bit/AUTHORS 32bit/MAILING-LIST 32bit/NEWS 32bit/README 32bit/COPYING 32bit/doc/sample.wgetrc /var/tmp/wget-1.19.1-1-root/opt/freeware/doc/wget-1.19.1
+ exit 0
Finding  Provides: (using /opt/freeware/lib/rpm/find-provides)...
Finding  Requires: (using /opt/freeware/lib/rpm/find-requires)...
Provides: webclient
PreReq: /bin/sh
Requires: /sbin/install-info libc.a(shr.o) libcrypto.a(libcrypto.so) libintl.a(libintl.so.8) libpthreads.a(shr_xpg5.o) libssl.a(libssl.so) libz.a(libz.so.1)
